program: Gaussian 09
title: 000124195
version: EM64L-G09RevD.01
frameworkgroup: C1[X(C10H20N2O4)]
method: RPBEPBE
basis: SDD
operation: Freq
keyword: #p
keyword: freq=noraman
keyword: PBEPBE/SDD
title: #p freq=noraman PBEPBE/SDD
converged: YES YES NO NO
title: Mulliken charges:
elementType: O O O O N N C C C C C C C C C C H H H H H H H H H H H H H H H H H H H H
charge: -0.409734 -0.235048 -0.305999 -0.299011 -0.392641 -0.354678 0.000328 -0.145242 -0.364615 -0.733351 -0.712115 0.113608 -0.376649 0.300699 -0.218864 -0.674814 0.200630 0.251777 0.193326 0.229994 0.243308 0.212178 0.213231 0.311723 0.221541 0.206292 0.219372 0.256052 0.222772 0.325546 0.383670 0.225011 0.225929 0.209688 0.228457 0.227631
chargesum: 0.00000
title: Mulliken charges with hydrogens summed into heavy atoms:
elementType: O O O O N N C C C C C C C C C C
charge: -0.026065 -0.235048 -0.305999 -0.299011 -0.080918 -0.029133 0.200958 0.106534 0.058704 -0.064634 -0.064910 0.113608 0.102176 0.300699 0.232076 -0.009038
polarizability: 1.79455906e+02 4.48548708e+00 1.23201537e+02 4.20425283e+00 -8.89144653e-01 1.17925449e+02
1716.lowfreq: -8.3813 -0.0002 0.0002 0.0007 1.0500 5.0457 9.1612 21.3716 26.2729
frequency: -1.9716 21.2635 26.0720 35.4309 45.3985 61.9506 87.4554 92.1382 115.7523 135.3442 155.1639 176.5454 217.1401 223.1556 227.3237 244.1431 252.7263 270.9887 283.6140 351.1732 354.2865 394.6235 421.7136 458.9950 482.9919 519.1074 575.4526 588.3514 619.0784 626.4426 681.0182 692.5494 699.7510 775.7556 801.3877 812.8752 829.4987 862.7466 903.7842 930.3356 962.7996 1003.1146 1018.7523 1029.7952 1037.8771 1063.2865 1091.3777 1101.7756 1115.5638 1128.2884 1133.5270 1139.5892 1164.8466 1174.2815 1200.5878 1224.6274 1250.0194 1255.8542 1265.3741 1274.7812 1297.7687 1318.4305 1345.3195 1353.9425 1359.0123 1382.2339 1391.4753 1397.5868 1400.4596 1462.8231 1463.3551 1465.9335 1475.4052 1476.5467 1477.3990 1480.4940 1483.1378 1490.4402 1491.3773 1494.8872 1649.3320 1659.1622 2945.7710 2955.0156 2960.6994 2973.3393 2974.4015 2981.8985 2994.3578 3006.6000 3011.0154 3041.5600 3063.7597 3065.9861 3070.5492 3074.2135 3084.0678 3091.4195 3105.4167 3502.8014 3504.9426 3562.3230
redmass: 4.1353 4.2583 3.6468 3.5162 3.0934 5.0065 4.3932 2.5735 2.6179 4.2818 2.9341 2.5024 1.9302 2.8676 1.6214 1.4730 1.1897 2.9053 4.2256 4.0159 3.3666 2.8889 3.3756 2.8210 3.8203 1.8497 2.0440 1.6721 1.3825 1.9586 2.6647 4.8718 8.6792 1.6088 1.0954 1.9432 3.0946 2.5051 2.3761 3.5071 1.2253 2.1398 1.7169 2.6422 3.4573 2.1798 2.4405 3.2015 2.4905 3.1686 1.9978 1.4699 2.5323 2.2800 2.4054 1.3004 1.1322 1.2902 1.2229 1.4255 1.3283 1.2765 1.4777 1.3752 1.4636 1.2150 1.2123 1.2617 1.2935 1.0427 1.3182 1.1340 1.1872 1.0546 1.0581 1.2469 1.0969 1.0624 1.0684 1.1925 8.1397 9.3170 1.0800 1.0825 1.0596 1.0366 1.0374 1.0632 1.0357 1.0580 1.1052 1.0961 1.1068 1.0987 1.0984 1.0996 1.0996 1.0985 1.1025 1.0755 1.0646 1.0773
irintensity: 0.6092 0.8797 0.4465 0.3195 0.3039 1.3460 4.6326 1.6632 5.5812 0.5869 4.6735 2.8441 1.3686 1.6694 3.0838 0.6463 0.7590 1.7853 11.9855 3.9465 2.4603 5.8214 15.2986 13.4873 32.3244 23.3816 70.6733 33.0854 138.1508 26.8678 85.2797 7.9790 29.9864 7.2415 3.9123 0.8238 7.3353 6.2492 8.2288 38.0964 9.0308 121.8228 24.1608 196.8702 0.7558 62.4710 90.2053 104.5326 71.8029 113.5265 13.6107 8.3547 170.5752 1.9132 137.3172 15.4907 0.0658 3.8445 47.7790 7.6076 15.0201 11.7975 15.3238 31.9458 9.7189 24.2733 14.2815 27.4972 27.1797 12.9094 219.7906 66.7349 55.7491 6.8997 11.6284 98.4219 1.9429 21.7635 15.4419 66.9229 194.1927 346.8036 22.8664 23.7812 49.0748 46.0170 11.7944 42.8974 23.2608 27.7040 33.7565 2.1253 10.6704 8.4580 80.5628 64.5538 26.0370 34.2085 48.8583 39.9015 16.4678 31.8898
temp: 298.150 k
press: 1.00000 atm
elementType: 8 8 8 8 7 7 6 6 6 6 6 6 6 6 6 6 1 1 1 1 1 1 1 1 1 1 1 1 1 1 1 1 1 1 1 1
symmnumber: 1
zpe: 792384.3 jmol-1
zpe.correction: 0.301803 hartree
zpe.thermalcorrener: 0.320602 hartree
zpe.thermalcorrenthalpy: 0.321547 hartree
zpe.thermalcorrgfe: 0.252208 hartree
zpe.sumelectzpe: -802.178123 hartree
zpe.sumelectthermal: -802.159324 hartree
zpe.sumelectthermalent: -802.158379 hartree
zpe.sumelectthermalfe: -802.227718 hartree
dipole: -2.1501 -1.9124 1.0045
dipole: 3.0478
quadrupole: -80.8938 -99.7263 -102.5797
quadrupole: -4.8749 7.3945 0.0678
quadrupole: 13.5062 -5.3264 -8.1798 -4.8749 7.3945 0.0678
hfenergy: -802.4799261 hartree
pointgroup: C01[X(C10H20N2O4)]
dipole: -0.8247013 0.4909265 -0.7188097 debye
polarizability: 179.3377267|-6.6159506|121.473279|-0.3942032|-2.8008376|119.7718864 unknown
InChI: InChI=1S/C10H20N2O4/c1-4-7(3)8(9(13)14)11-6-12-10(15)16-5-2/h7-8,11-13H,4-6H2,1-3H3
charge 0 multiplicity 1
36 atoms
O  -4.150029 -1.046759 0.876002
O  -2.401709 -2.556158 0.699474
O  3.912397 0.071572 -0.205829
O  3.217292 0.003705 2.049961
N  -0.526526 -0.557123 0.534912
N  1.705518 0.333944 0.274281
C  -2.260475 0.6218 -0.862132
C  -1.932963 -0.132245 0.487079
C  -3.570561 1.451744 -0.847441
C  -2.210725 -0.34879 -2.061858
C  -3.630844 2.555725 0.231975
C  -2.802809 -1.370192 0.688298
C  0.474921 0.351566 1.082014
C  2.951015 0.127026 0.824363
C  5.312585 -0.149314 0.250866
C  6.185613 -0.136571 -1.000672
H  -1.416519 1.338414 -0.96359
H  -2.182469 0.558978 1.321513
H  -3.667625 1.921375 -1.847352
H  -4.437487 0.775409 -0.731268
H  -1.296233 -0.966799 -2.023642
H  -3.087849 -1.024307 -2.066664
H  -2.215289 0.208661 -3.016072
H  -0.391787 -1.556162 0.71924
H  -4.525313 3.189589 0.091801
H  -2.742712 3.215445 0.185246
H  -3.690869 2.132856 1.25156
H  0.796374 0.114978 2.117091
H  0.041256 1.371443 1.090018
H  1.616597 0.357793 -0.74288
H  -4.670839 -1.887113 0.99935
H  5.361946 -1.114648 0.786961
H  5.583931 0.651799 0.962223
H  7.242612 -0.300329 -0.721752
H  5.882787 -0.934898 -1.699835
H  6.109488 0.832186 -1.523642
