program: Gaussian 09
title: 000124174
version: EM64L-G09RevD.01
frameworkgroup: C1[X(C20H26O3)]
method: RPBEPBE
basis: SDD
operation: Freq
keyword: #pfreq=noraman
keyword: PBEPBE/SDD
title: #p freq=noraman PBEPBE/SDD
converged: YES YES NO NO
title: Mulliken charges:
elementType: O O O C C C C C C C C C C C C C C C C C C C C H H H H H H H H H H H H H H H H H H H H H H H H H H
charge: -0.290708 -0.445729 -0.437507 0.309966 -0.159157 0.233222 -0.103383 -0.549761 -0.519827 -0.521310 -0.159296 -0.138932 -0.483466 -0.792528 -0.510576 -0.385713 0.251769 -0.578897 0.300565 -0.347158 -0.534826 -0.446889 0.286599 0.207399 0.237307 0.220259 0.223695 0.246224 0.257991 0.210361 0.193159 0.204106 0.235390 0.229866 0.191561 0.206288 0.221437 0.248858 0.224817 0.214926 0.213452 0.218398 0.317730 0.224407 0.228648 0.220784 0.255823 0.218065 0.352593
chargesum: 0.00000
title: Mulliken charges with hydrogens summed into heavy atoms:
elementType: O O O C C C C C C C C C C C C C C C C C C C C
charge: -0.290708 -0.127999 -0.084914 0.309966 0.048242 0.233222 0.133925 -0.105808 -0.015612 -0.117790 0.044810 0.096458 -0.062040 -0.115945 -0.070833 0.046137 0.251769 -0.125842 0.300565 -0.126374 -0.279003 -0.228824 0.286599
polarizability: 2.86475215e+02 -1.74376099e+00 2.11840292e+02 3.94586549e+00 -1.14878447e+00 1.49157407e+02
1716.lowfreq: -8.6598 -3.5955 -0.0009 -0.0007 -0.0006 8.3020 26.5550 36.7639 57.9441
frequency: 26.2866 36.5424 57.8542 80.1560 90.4917 119.7622 135.8535 155.6320 191.9261 205.2593 214.2963 229.8575 233.8774 255.6044 266.7888 290.9952 308.1843 319.9923 328.2533 346.3312 351.3280 362.0838 389.4124 397.3995 408.3464 437.6033 443.4548 457.8814 464.8033 487.1736 512.0351 532.4754 558.9248 577.2901 622.1855 629.7102 647.3693 692.5951 707.6372 724.0853 737.9206 773.3992 778.9138 803.9366 822.9281 835.2228 840.1264 849.8912 873.4168 888.1047 905.7943 921.3293 925.0302 933.0040 948.8268 964.0815 972.8643 991.6411 1005.8871 1015.1157 1017.0403 1027.0630 1039.7865 1043.5394 1060.9233 1084.9367 1102.6702 1107.7374 1114.5769 1121.5112 1128.3392 1136.5192 1146.0771 1152.7079 1168.8793 1177.2468 1179.9107 1186.6534 1202.7513 1216.0528 1223.5291 1234.7351 1247.4094 1251.7526 1257.9114 1263.8989 1270.7207 1277.8234 1283.4881 1291.1434 1301.8161 1303.9863 1313.9500 1327.2823 1332.1596 1335.6102 1345.5155 1352.6375 1367.5119 1378.2749 1382.3871 1398.8400 1441.5361 1455.5330 1456.7426 1466.2781 1467.5116 1473.6911 1474.5105 1477.1265 1491.1388 1492.2598 1493.9000 1585.9386 1630.8111 2895.8097 2916.9551 2955.2099 2959.5503 2959.6660 2972.7918 2986.1258 2994.7915 2997.2574 3010.4618 3020.2615 3031.3584 3038.2776 3042.0286 3054.9462 3061.5748 3078.2356 3080.1421 3093.6984 3102.6084 3112.5750 3141.9631 3151.7078 3169.0087 3533.8977 3582.0308
redmass: 4.7746 4.9494 3.3683 3.5413 2.7554 4.5176 1.9234 3.5933 1.8085 2.2212 3.0653 3.3386 3.1149 3.0513 2.7542 3.0914 1.5396 4.0279 3.2051 1.1138 3.3558 2.1515 3.2365 3.8897 3.0849 3.7383 2.9221 3.7323 3.5722 2.7321 3.4657 4.0358 2.7803 3.7524 3.6144 2.9952 3.1728 2.7704 4.0371 4.2178 5.0001 1.9771 2.1305 1.9098 2.0662 2.4981 2.2828 1.9445 2.3924 1.6433 2.6409 2.1892 1.5140 1.8135 1.6442 2.5905 1.8322 2.0885 2.1670 1.8293 1.6560 1.8244 1.8321 2.0015 2.5965 2.3937 2.1526 1.4673 2.0531 1.7480 1.4544 1.8652 1.5030 1.4716 1.8391 1.5097 1.5955 1.6085 1.8834 1.6720 1.5405 1.4409 1.5190 1.6117 2.4642 1.4406 1.7692 1.4826 1.4148 1.3605 1.6064 1.4491 1.4048 1.3894 1.4367 1.4878 1.4406 1.4723 1.6838 1.6590 4.7822 1.1931 2.8868 1.0752 1.1769 1.1110 1.1681 1.0864 1.0805 1.0715 1.0817 1.0689 2.6889 7.1438 6.4373 1.0797 1.0795 1.0595 1.0708 1.0706 1.0702 1.0615 1.0573 1.0441 1.0979 1.0940 1.0620 1.1006 1.1020 1.1013 1.0533 1.0884 1.0958 1.1035 1.0992 1.0889 1.0916 1.0933 1.1176 1.0657 1.0660
irintensity: 0.2475 2.6039 2.1982 1.1961 2.1129 1.7819 2.5199 0.2875 9.9392 0.3531 2.9095 9.7087 2.0611 3.9760 24.7632 2.1868 70.3220 10.4938 31.3167 139.9272 7.8190 17.8015 1.0391 2.1688 6.2797 2.2331 3.6973 0.4294 4.8577 0.6767 1.1765 0.5451 10.9107 1.1705 7.3016 4.0784 16.6645 2.5347 1.8794 2.4877 9.1142 24.8909 20.9300 23.4904 2.4595 4.1155 7.9676 10.8891 5.9368 32.1136 46.6117 7.4426 2.2297 5.0785 20.4712 14.8919 5.8801 1.3138 4.0791 33.2712 2.0696 6.2140 1.3215 18.6481 9.7050 1.6264 22.8986 13.7292 17.2010 11.7927 23.8314 6.1230 86.1845 14.3197 9.9919 54.2189 1.8756 12.2325 1.3513 2.7638 20.1701 4.4750 9.8358 9.1497 20.3638 20.9482 5.7262 32.0554 22.3170 7.3057 4.4971 1.0033 0.5372 0.4307 1.1961 0.9869 0.4795 4.6763 5.1707 0.2730 18.6230 23.7349 7.0252 3.3971 5.4408 9.3231 2.0059 1.4524 19.7419 2.8125 12.6092 4.8892 96.6226 31.3997 51.4688 14.2612 21.9002 51.7524 28.2329 3.4609 49.4130 24.7952 32.5739 25.6622 42.6169 33.8031 18.4838 32.8681 65.7471 24.1102 37.4834 26.6478 30.7469 24.0474 26.7789 21.2272 11.4930 14.6435 20.2155 3.7546 38.7673
temp: 298.150 k
press: 1.00000 atm
elementType: 8 8 8 6 6 6 6 6 6 6 6 6 6 6 6 6 6 6 6 6 6 6 6 1 1 1 1 1 1 1 1 1 1 1 1 1 1 1 1 1 1 1 1 1 1 1 1 1 1
symmnumber: 1
zpe: 1092145.0 jmol-1
zpe.correction: 0.415976 hartree
zpe.thermalcorrener: 0.436936 hartree
zpe.thermalcorrenthalpy: 0.437880 hartree
zpe.thermalcorrgfe: 0.367395 hartree
zpe.sumelectzpe: -1001.612616 hartree
zpe.sumelectthermal: -1001.591657 hartree
zpe.sumelectthermalent: -1001.590713 hartree
zpe.sumelectthermalfe: -1001.661197 hartree
dipole: 2.3038 -3.2946 0.2075
dipole: 4.0255
quadrupole: -162.4346 -122.6132 -141.9554
quadrupole: 0.2851 -1.6921 0.7705
quadrupole: -20.1002 19.7212 0.3790 0.2851 -1.6921 0.7705
hfenergy: -1002.0285925 hartree
pointgroup: C01 [X(C20H26O3)]
dipole: -0.9082585 -1.2921406 -0.1171966 debye
polarizability: 286.489574|1.5354005|211.7204888|3.8194814|2.9170782|149.2628504 unknown
InChI: InChI=1S/C20H26O3/c1-19-8-6-15-14-5-3-13(21)10-12(14)2-4-16(15)17(19)7-9-20(19,22)18-11-23-18/h3,5,10,15-18,21-22H,2,4,6-9,11H2,1H3
charge 0 multiplicity 1
49 atoms
O  5.198686 -0.125433 1.606651
O  4.416795 -0.494203 -1.367136
O  -6.655032 -0.33338 -0.005891
C  1.96389 -0.267438 -0.684157
C  1.274891 0.881469 0.122537
C  3.485064 0.006187 -0.338099
C  -0.248798 0.934229 -0.093999
C  2.139174 2.128803 -0.19909
C  3.592346 1.567968 -0.347637
C  1.362085 -1.623181 -0.234039
C  -0.867303 -0.435719 0.32872
C  3.867026 -0.55474 1.042409
C  -0.183852 -1.633653 -0.393173
C  1.780954 -0.102059 -2.219651
C  -0.939013 2.062879 0.701535
C  4.949672 -1.569344 1.256017
C  -2.400218 -0.420396 0.198697
C  -2.425627 2.164164 0.305633
C  -3.128328 0.809471 0.227699
C  -3.13956 -1.626291 0.098336
C  -4.540163 0.795877 0.15737
C  -4.548009 -1.643436 0.026758
C  -5.250001 -0.416703 0.057114
H  1.419167 0.654127 1.204189
H  -0.46037 1.107633 -1.170705
H  2.074693 2.895819 0.592227
H  1.797733 2.602002 -1.139347
H  4.059371 1.868984 -1.300521
H  4.259437 1.907477 0.461579
H  1.602968 -1.81531 0.831138
H  1.793342 -2.464168 -0.816266
H  -0.62962 -0.546816 1.414024
H  3.074539 -0.504329 1.80237
H  -0.465446 -1.626122 -1.463823
H  -0.562268 -2.587278 0.021383
H  2.218315 -0.962745 -2.757595
H  0.716262 -0.046981 -2.499536
H  2.284301 0.801404 -2.600915
H  -0.439797 3.032314 0.514192
H  -0.843847 1.852717 1.787088
H  4.890266 -2.253143 2.11294
H  5.533846 -1.919106 0.396714
H  4.248376 -1.462494 -1.501987
H  -2.498632 2.653425 -0.68831
H  -2.970301 2.822398 1.009574
H  -2.612367 -2.585203 0.076484
H  -5.106689 1.733419 0.180981
H  -5.086872 -2.596969 -0.050213
H  -7.055387 -1.235524 -0.072168
