program: Gaussian 09
title: 000124246
version: EM64L-G09RevD.01
frameworkgroup: C1[X(C17H14N2O6S)]
method: RPBEPBE
basis: SDD
operation: Freq
keyword: #p
keyword: freq=noraman
keyword: PBEPBE/SDD
title: #p freq=noraman PBEPBE/SDD
converged: YES YES NO NO
title: Mulliken charges:
elementType: S O O O O O O N N C C C C C C C C C C C C C C C C C H H H H H H H H H H H H H H
charge: 0.971955 -0.220679 -0.344646 -0.277507 -0.520403 -0.517421 -0.261384 -0.547951 -0.387347 0.208907 0.271697 0.204621 0.207550 -0.420216 -0.475764 0.025074 0.264067 -0.258379 -0.727069 0.373243 -0.352095 -0.382853 -0.198303 -0.191988 -0.239857 -0.075634 0.290605 0.314323 0.325254 0.326046 0.276897 0.286873 0.283334 0.346831 0.271113 0.258556 0.236132 0.234182 0.235213 0.187020
chargesum: 0.00000
title: Mulliken charges with hydrogens summed into heavy atoms:
elementType: S O O O O O O N N C C C C C C C C C C C C C C C C C
charge: 0.971955 -0.220679 -0.344646 -0.277507 -0.520403 -0.517421 -0.261384 -0.222697 -0.040516 0.208907 0.271697 0.204621 0.207550 -0.129611 -0.161441 0.025074 0.264067 0.067668 0.120035 0.373243 -0.080982 -0.124297 0.037829 0.042195 -0.004644 0.111387
polarizability: 3.96034416e+02 -2.63743967e+01 3.28839091e+02 -9.60807596e+00 4.17679418e+00 1.58580049e+02
1716.lowfreq: -3.4435 -0.0008 0.0012 0.0017 1.2602 6.5966 15.4280 23.0609 26.4812
frequency: 15.3830 23.0022 26.4477 35.4310 36.8018 50.6609 64.2235 91.8474 118.6315 128.7703 141.7435 148.0283 161.6581 172.1825 181.4022 190.0930 226.7571 245.6870 250.1235 265.0838 280.8203 308.6693 324.9073 343.5498 357.8871 388.7260 395.5511 409.7808 434.1706 440.7797 453.7507 476.1050 504.3884 510.1208 522.2393 572.9945 580.8628 600.7948 610.6360 636.9339 642.9468 690.3529 701.9474 719.8330 736.0223 768.4300 780.6029 784.7759 790.6041 811.0626 836.2772 839.7830 846.4611 863.8419 882.0035 885.7537 908.5451 914.6818 920.3205 942.7819 952.0940 972.2758 983.9760 988.1915 993.6984 1019.2333 1026.8906 1063.6654 1076.6834 1098.6409 1131.1714 1165.7396 1172.3101 1175.3113 1190.1777 1209.0749 1215.6235 1264.0184 1273.3867 1283.1095 1307.4551 1315.5034 1338.0199 1363.2391 1383.6100 1413.0783 1415.1663 1418.7868 1439.5234 1445.4484 1468.3968 1473.1437 1500.4456 1536.5534 1556.5179 1597.2872 1605.7659 1608.4441 1616.8455 1618.9438 2968.0826 3038.0005 3137.0475 3146.2344 3159.1024 3166.0557 3168.1638 3177.6881 3184.9139 3196.5111 3197.6052 3233.7705 3320.9486 3403.5944
redmass: 5.7421 5.2020 5.8058 6.6629 8.5896 5.9970 7.5300 7.9941 7.8850 7.1388 4.4009 3.2094 1.4813 4.9463 6.8075 5.7023 4.2756 4.9786 5.2898 6.7380 5.1378 6.0830 8.1018 7.2523 6.4206 8.3027 5.7538 2.8967 5.5298 5.2489 4.6695 4.5549 4.5727 6.6056 5.4137 7.5468 7.4243 6.9686 6.6077 5.7530 7.9885 2.3846 6.2983 4.3432 3.1771 3.1737 3.4108 3.0399 1.3556 11.9043 1.4013 3.4887 6.7082 1.6141 1.3468 2.2367 1.4419 1.8177 1.4079 2.9895 1.5795 1.3709 1.3106 5.7848 1.3198 2.1425 1.8263 5.1498 1.5066 2.8616 2.5259 1.6755 1.2867 1.6699 2.4521 2.5752 1.3122 1.7728 5.4285 1.5256 1.3364 1.1428 3.7987 1.2530 9.2623 1.0551 1.9370 1.4039 2.9497 4.2773 3.5487 2.6176 2.6788 7.3928 7.3342 6.2474 6.8481 6.9100 6.5301 6.8693 1.0877 1.0249 1.0853 1.0891 1.0933 1.0922 1.0967 1.1011 1.1075 1.1072 1.0934 1.0967 1.0732 1.0769
irintensity: 1.0346 1.3959 4.6837 0.3031 0.1781 0.1873 1.3837 0.6907 11.2848 4.2907 1.7393 18.2184 13.4894 8.2598 5.8980 8.5623 2.0486 2.5022 13.1598 3.7761 19.8528 16.7703 44.5206 15.7311 9.8507 13.5218 17.2955 0.1642 11.5063 37.5821 0.5844 8.4962 0.2626 14.0070 5.9628 16.8097 43.6680 32.5460 1.4473 6.0456 2.0865 26.3858 2.1877 11.0802 20.0446 29.8854 51.9992 44.4770 48.0373 52.8754 11.6937 51.3037 7.9844 19.4583 52.3340 92.2522 12.8802 38.4272 12.2328 23.2535 1.3895 0.2747 42.6120 5.4796 0.5019 14.9832 38.7056 9.8075 13.1360 31.7035 26.9240 148.1744 14.7043 18.7236 230.6267 89.8296 33.8804 3.5859 25.3631 33.7586 1.8145 3.4156 190.9474 49.1227 3.0404 14.3201 84.2508 16.9313 180.3338 278.6973 169.2990 15.3629 408.2755 211.6077 37.9145 46.9644 4.5044 213.7470 138.6797 55.7062 122.0909 0.1475 1.0050 7.4368 24.8868 5.6045 9.5072 8.2508 0.1497 0.3653 0.8336 8.0207 45.2730 68.4195
temp: 298.150 k
press: 1.00000 atm
elementType: 16 8 8 8 8 8 8 7 7 6 6 6 6 6 6 6 6 6 6 6 6 6 6 6 6 6 1 1 1 1 1 1 1 1 1 1 1 1 1 1
symmnumber: 1
zpe: 742700.4 jmol-1
zpe.correction: 0.282880 hartree
zpe.thermalcorrener: 0.307156 hartree
zpe.thermalcorrenthalpy: 0.308100 hartree
zpe.thermalcorrgfe: 0.225539 hartree
zpe.sumelectzpe: -1613.092429 hartree
zpe.sumelectthermal: -1613.068153 hartree
zpe.sumelectthermalent: -1613.067208 hartree
zpe.sumelectthermalfe: -1613.149770 hartree
dipole: 3.8005 1.4479 -3.1204
dipole: 5.1261
quadrupole: -168.2551 -135.2221 -158.6576
quadrupole: -11.7185 -12.3972 14.1570
quadrupole: -14.2102 18.8228 -4.6126 -11.7185 -12.3972 14.1570
hfenergy: -1613.3753089 hartree
pointgroup: C01 [X(C17H14N2O6S1)]
dipole: 1.5880641 0.4979389 -1.1390735 debye
polarizability: 389.5953009|-33.1148666|333.5547421|-4.6682301|19.4874685|160.3035124 unknown
InChI: InChI=1S/C17H14N2O6S/c1-26(22,23)19-13-8-15-12(17(21)14(9-24-15)18-10-20)7-16(13)25-11-5-3-2-4-6-11/h2-10,18-19H,1H3
charge 0 multiplicity 1
40 atoms
S  2.365292 -3.48391 0.244379
O  -2.765212 -1.496143 -0.597695
O  2.429716 0.59994 -0.645935
O  -2.415094 2.586179 0.225494
O  3.668959 -3.13091 1.156794
O  0.936246 -3.862993 0.924373
O  -6.665892 -0.007449 0.039919
N  2.01349 -2.042032 -1.145394
N  -4.871978 1.492888 0.207816
C  0.904459 -1.224783 -0.848809
C  -1.315087 0.479582 -0.305686
C  -1.490005 -0.907141 -0.579364
C  1.088814 0.180463 -0.563629
C  -0.404631 -1.755843 -0.858841
C  0.00159 1.017167 -0.30988
C  -2.479799 1.330481 -0.030873
C  -3.78568 0.639012 -0.064748
C  -3.883638 -0.711979 -0.339495
C  2.840382 -4.871849 -0.962985
C  2.848693 1.833139 -0.052868
C  2.624672 2.095338 1.315539
C  3.581061 2.714705 -0.871204
C  3.142101 3.28755 1.868591
C  4.097815 3.900703 -0.301366
C  3.876761 4.191467 1.064899
C  -6.211956 1.153415 0.248868
H  -0.57575 -2.813535 -1.066257
H  0.12183 2.085405 -0.107177
H  2.893291 -1.48406 -1.101299
H  -4.815629 -1.273515 -0.378322
H  3.745385 -4.536023 -1.486155
H  3.019398 -5.759077 -0.339688
H  1.985686 -4.990624 -1.640448
H  -4.569841 2.463428 0.387526
H  2.071415 1.381734 1.934249
H  3.738087 2.467712 -1.925289
H  2.977333 3.503177 2.929487
H  4.669122 4.595402 -0.926155
H  4.276772 5.112427 1.501605
H  -6.859476 2.024353 0.489224
