program: Gaussian 09
title: 000124103
version: EM64L-G09RevD.01
frameworkgroup: C1[X(C13H13NO2)]
method: RPBEPBE
basis: SDD
operation: Freq
keyword: #p
keyword: freq=noraman
keyword: PBEPBE/SDD
title: #p freq=noraman PBEPBE/SDD
converged: YES YES NO NO
title: Mulliken charges:
elementType: O O N C C C C C C C C C C C C C H H H H H H H H H H H H H
charge: -0.409583 -0.257238 -0.450823 0.216386 0.353462 0.312286 0.426786 -0.167946 -0.607031 -0.346676 -0.380369 -0.800731 -0.278963 -0.276631 0.215357 -0.784766 0.315425 0.191539 0.185569 0.296177 0.238520 0.238233 0.226793 0.230603 0.232713 0.353554 0.258193 0.258201 0.210958
chargesum: 0.00000
title: Mulliken charges with hydrogens summed into heavy atoms:
elementType: O O N C C C C C C C C C C C C C
charge: -0.056029 -0.257238 -0.154646 0.216386 0.353462 0.312286 0.426786 -0.167946 -0.291605 -0.155137 -0.194800 -0.097185 -0.048359 -0.043918 0.215357 -0.057413
polarizability: 2.25438349e+02 1.10276336e+01 2.06143484e+02 9.21295698e-03 4.53456718e-02 7.05385696e+01
1716.lowfreq: -10.1418 -2.0193 -0.0004 -0.0002 0.0004 1.2671 34.7230 49.8144 52.1978
frequency: 34.7079 49.8025 52.1968 66.6180 84.3690 108.7942 128.3417 194.9829 225.5814 240.1899 252.5594 279.7039 316.0597 323.7148 385.8704 426.7107 434.8464 468.9659 498.0704 512.9400 565.6422 583.5799 603.4240 609.6483 641.9704 664.1091 685.4650 701.1701 750.7625 779.1406 815.8779 850.0618 908.9037 928.6480 940.0994 943.9608 972.3648 986.9419 1012.6044 1039.3469 1045.1547 1051.3533 1069.0584 1097.4396 1152.6219 1187.7732 1201.8776 1226.0204 1261.4982 1284.1259 1302.2883 1372.9815 1389.4413 1397.7737 1400.8484 1416.4383 1431.1620 1448.4543 1449.3348 1459.0867 1469.7293 1472.6257 1492.6265 1542.4937 1595.2946 1605.6628 1620.8267 1635.7180 2984.8489 2992.5448 3061.1156 3091.6225 3093.2617 3097.0529 3098.6308 3110.3788 3143.5527 3165.6128 3182.0923 3564.1590 3591.3231
redmass: 4.0529 1.6804 1.4154 1.8721 1.3542 3.1506 4.3137 2.9396 1.9441 4.6720 3.3411 4.0188 5.0916 4.3403 3.6791 3.0768 5.3281 5.5886 3.2624 5.0329 4.0480 2.9656 1.5476 6.0449 2.5492 3.4024 5.6330 5.8016 1.5258 1.9428 4.4826 2.4746 5.0827 1.3837 3.9600 1.3513 1.3412 1.8012 1.5997 1.6180 2.3023 1.5518 3.1997 4.1042 1.5050 1.1110 1.5614 2.0748 1.7229 1.7348 3.8320 2.3793 1.2234 3.4066 1.4097 6.2581 2.7322 1.0456 2.5464 1.0454 1.1024 1.3255 2.0128 2.9786 7.4198 6.2236 5.9756 4.7110 1.0369 1.0364 1.0966 1.0876 1.1002 1.0980 1.1001 1.0867 1.0916 1.0997 1.0926 1.0754 1.0654
irintensity: 3.4470 20.4406 0.4542 0.7648 3.0459 2.6646 4.7462 18.4800 65.6648 1.0711 1.8042 0.1685 10.2083 1.1536 7.2531 17.9848 3.7158 1.8328 0.0701 12.4345 24.1165 1.9351 10.5692 2.5728 44.7295 14.5745 0.5603 17.8968 106.7545 0.5056 4.9141 0.2200 2.8253 0.5312 1.0016 19.4558 0.0026 17.5633 28.1602 14.8582 11.2033 11.5601 64.7797 53.9174 82.5696 0.1954 34.4845 123.5454 10.8239 16.6004 14.8099 37.4161 88.5477 34.0458 51.7745 177.0284 24.9792 14.7120 15.4051 13.2646 16.0294 3.8137 351.9446 107.0079 4.4616 34.8484 147.5062 8.6038 27.1460 14.8009 16.3253 23.4338 20.7391 7.6133 15.6285 16.0534 25.0368 26.2645 6.9323 15.9898 28.0498
temp: 298.150 k
press: 1.00000 atm
elementType: 8 8 7 6 6 6 6 6 6 6 6 6 6 6 6 6 1 1 1 1 1 1 1 1 1 1 1 1 1
symmnumber: 1
zpe: 600074.7 jmol-1
zpe.correction: 0.228556 hartree
zpe.thermalcorrener: 0.243902 hartree
zpe.thermalcorrenthalpy: 0.244847 hartree
zpe.thermalcorrgfe: 0.184818 hartree
zpe.sumelectzpe: -707.269200 hartree
zpe.sumelectthermal: -707.253854 hartree
zpe.sumelectthermalent: -707.252910 hartree
zpe.sumelectthermalfe: -707.312938 hartree
dipole: -1.6264 -4.5339 0.0023
dipole: 4.8168
quadrupole: -83.2407 -88.0202 -98.5567
quadrupole: -8.6301 0.0852 0.0003
quadrupole: 6.6985 1.9190 -8.6175 -8.6301 0.0852 0.0003
hfenergy: -707.4977561 hartree
pointgroup: C01 [X(C13H13N1O2)]
dipole: 0.8655789 1.6853286 -0.0410007 debye
polarizability: 227.9434704|8.1582017|203.5645461|-1.003035|-3.0424297|70.6123859 unknown
InChI: InChI=1S/C13H13NO2/c1-8-7-12(14-9(2)15)10-5-3-4-6-11(10)13(8)16/h3-7,14,16H,1-2H3
charge 0 multiplicity 1
29 atoms
O  2.677825 -2.298385 0.052279
O  -3.728475 -0.760893 0.047582
N  -2.03369 0.873779 0.008711
C  0.431353 0.772353 -0.003832
C  1.646766 -0.022494 0.007829
C  -0.843741 0.088155 0.018992
C  0.300704 -2.105019 0.06119
C  1.545681 -1.458136 0.039813
C  -0.884237 -1.315241 0.050528
C  0.564516 2.201491 -0.037494
C  2.914283 0.650206 -0.012969
C  0.224506 -3.61633 0.095457
C  1.812811 2.827113 -0.057731
C  3.004908 2.042012 -0.045042
C  -3.365243 0.453177 0.022444
C  -4.387148 1.590196 0.003661
H  -1.857492 -1.809477 0.067012
H  -0.321157 2.848381 -0.048937
H  3.851534 0.076651 -0.003432
H  -1.900174 1.884321 -0.010585
H  0.747028 -4.0603 -0.771645
H  0.724044 -4.018832 0.995993
H  -0.823067 -3.958714 0.090605
H  1.879084 3.919798 -0.083129
H  3.983779 2.532057 -0.060421
H  3.517388 -1.777955 0.028901
H  -5.032416 1.506019 0.8951
H  -5.036383 1.472923 -0.88117
H  -3.940388 2.599944 -0.016309
