program: Gaussian 09
title: 000014840
version: EM64L-G09RevD.01
frameworkgroup: C1[X(C15H20Cl2O4)]
method: RPBEPBE
basis: SDD
operation: Freq
keyword: #p
keyword: freq=noraman
keyword: PBEPBE/SDD
title: #p freq=noraman PBEPBE/SDD
converged: YES YES NO NO
title: Mulliken charges:
elementType: Cl Cl O O O O C C C C C C C C C C C C C C C H H H H H H H H H H H H H H H H H H H H
charge: -0.002465 -0.050877 -0.287346 -0.247998 -0.223189 -0.193594 0.050509 -0.377295 -0.251167 -0.345680 -0.335389 -0.709174 -0.687027 0.212239 -0.394828 0.490066 -0.300940 -0.296711 -0.195405 -0.231792 -0.104673 0.225220 0.188110 0.208061 0.194159 0.176863 0.183192 0.229964 0.221979 0.247463 0.226261 0.230645 0.223727 0.211645 0.213625 0.205586 0.247175 0.250203 0.259049 0.281973 0.257837
chargesum: 0.00000
title: Mulliken charges with hydrogens summed into heavy atoms:
elementType: Cl Cl O O O O C C C C C C C C C C C C C C C
charge: -0.002465 -0.050877 -0.287346 -0.247998 -0.223189 -0.193594 0.275728 0.018876 0.119854 0.067475 0.134053 -0.028541 -0.056172 0.212239 0.102550 0.490066 -0.300940 -0.037662 0.086568 0.026045 -0.104673
polarizability: 2.49018408e+02 -3.18046718e+01 1.99037132e+02 -9.76345400e+00 -2.65011004e+01 1.42550199e+02
1716.lowfreq: -10.0643 -3.5637 -0.0013 0.0009 0.0016 1.6196 6.2066 10.8080 14.3038
frequency: 5.8017 10.5705 13.6118 28.4783 36.4373 51.1538 61.0864 71.9831 79.6591 119.5675 127.0625 134.4175 156.0177 164.9242 168.7738 188.2957 197.8593 213.2295 229.6064 233.4572 256.3962 285.0890 307.5352 330.7392 338.3223 367.1726 391.5351 419.4763 440.1800 457.4936 494.4751 521.6145 533.2217 548.7966 576.6711 631.3650 661.7166 703.7989 708.8297 729.4743 780.6635 798.8587 805.7128 830.6705 856.4855 864.1959 867.3013 903.5930 919.2244 924.3861 956.9316 961.4501 973.7789 1001.1722 1018.3570 1036.2162 1041.4285 1071.4393 1081.5846 1085.6861 1105.5563 1120.3911 1126.0346 1138.2240 1150.8925 1160.9709 1206.7338 1212.8497 1238.1393 1238.2538 1256.7762 1260.6058 1288.0014 1301.0725 1302.5468 1319.5817 1351.5527 1359.2923 1364.1282 1372.7825 1383.5323 1387.1348 1388.4312 1390.3395 1429.0660 1446.3023 1451.0935 1466.7969 1469.5207 1473.4217 1477.3140 1477.4701 1483.2196 1487.5611 1570.2721 1595.4830 1678.8420 2918.9364 2958.4645 2967.4439 2967.6181 2969.7213 2971.0838 2985.3299 2988.1758 3023.8687 3027.2936 3036.0043 3044.6528 3069.9871 3070.9184 3084.7923 3091.6837 3123.2831 3160.3919 3179.9711 3182.8536
redmass: 7.5586 4.4700 4.1992 3.8908 4.4228 9.5192 5.0319 1.9228 4.6085 3.1688 4.9171 3.1979 10.6627 4.5582 4.3542 1.8175 2.3740 4.9402 1.1753 3.5555 2.1294 2.7748 3.5394 7.7259 3.7094 10.0521 8.3924 4.3125 3.2322 2.3634 4.1009 3.0435 5.0462 4.1157 3.6884 7.8042 5.3463 3.6554 6.4096 1.3572 1.8072 1.4938 6.4612 1.9260 3.1001 1.3905 1.8312 2.1181 1.9139 1.3473 2.5729 1.4780 2.2626 1.8615 5.9655 3.5414 4.2915 2.6467 3.0263 2.5729 1.9924 2.2697 2.7319 2.0530 1.3509 2.0227 1.0780 1.2507 2.5645 1.3190 1.6318 1.1704 1.1124 1.2919 1.2854 1.2004 2.2193 1.6544 1.6770 1.7921 1.3893 1.2385 1.2209 4.2755 1.0996 1.2578 1.0822 1.0602 1.9829 1.0519 1.0427 1.0486 1.0767 1.0842 7.6285 7.6343 10.3664 1.0568 1.0840 1.0572 1.0625 1.0747 1.0432 1.0631 1.0533 1.0945 1.1043 1.0590 1.1017 1.0994 1.1009 1.0996 1.0997 1.1065 1.0878 1.0960 1.0942
irintensity: 0.7010 0.0405 0.4483 0.1184 0.4052 1.0039 0.6043 0.9732 2.5190 5.0342 7.5832 3.4958 0.6899 0.3573 1.0382 0.6745 0.5936 0.3309 0.1156 1.1984 1.6669 4.9507 17.7539 0.0950 0.4990 9.4870 6.7798 0.6414 6.1438 6.2155 1.4910 2.2584 0.9345 8.6538 7.4185 9.9060 2.2218 0.6076 66.8485 11.2328 11.5349 53.8622 11.4218 1.3488 4.1650 21.4896 6.5246 8.4811 5.3431 0.0616 35.7577 0.5276 36.4938 0.2773 49.0936 25.1174 209.8873 9.3041 89.2820 73.8948 19.8084 87.0952 329.1153 42.7130 3.9489 14.4805 5.5729 0.4069 97.3576 0.5333 83.1293 9.2479 0.7733 0.0687 3.0781 36.8788 27.6911 2.0045 6.6693 5.5831 3.8754 14.4800 14.4990 3.5569 21.6076 177.5025 6.8799 11.0968 139.5862 3.5176 10.5002 6.4024 11.6243 14.9409 16.2334 7.7585 152.7866 52.4965 32.1715 11.8839 49.2840 34.2407 23.3865 50.6965 74.7800 11.0897 13.8093 31.2998 12.9077 63.5673 75.9546 26.1815 27.8127 10.0896 7.5825 1.6851 1.8395
temp: 298.150 k
press: 1.00000 atm
elementType: 17 17 8 8 8 8 6 6 6 6 6 6 6 6 6 6 6 6 6 6 6 1 1 1 1 1 1 1 1 1 1 1 1 1 1 1 1 1 1 1 1
symmnumber: 1
zpe: 846523.6 jmol-1
zpe.correction: 0.322424 hartree
zpe.thermalcorrener: 0.346146 hartree
zpe.thermalcorrenthalpy: 0.347090 hartree
zpe.thermalcorrgfe: 0.262179 hartree
zpe.sumelectzpe: -1802.959315 hartree
zpe.sumelectthermal: -1802.935593 hartree
zpe.sumelectthermalent: -1802.934649 hartree
zpe.sumelectthermalfe: -1803.019560 hartree
dipole: 3.8534 1.7328 -1.2110
dipole: 4.3952
quadrupole: -137.2664 -144.5278 -134.6366
quadrupole: -5.2200 5.2933 2.4906
quadrupole: 1.5439 -5.7175 4.1737 -5.2200 5.2933 2.4906
hfenergy: -1803.2817392 hartree
pointgroup: C01 [X(C15H20Cl2O4)]
dipole: -1.5319512 0.5683105 0.5659333 debye
polarizability: 248.4235483|33.0978596|188.4934184|-2.6333464|35.325452|153.6887717 unknown
InChI: InChI=1S/C15H20Cl2O4/c1-3-4-7-19-11(2)9-21-15(18)10-20-14-6-5-12(16)8-13(14)17/h5-6,8,11H,3-4,7,9-10H2,1-2H3
charge 0 multiplicity 1
41 atoms
Cl 3.641169 -1.989819 -1.963524
Cl 6.875907 1.789338 0.500605
O  -4.275083 0.109016 0.017063
O  -1.836982 -1.082176 1.132727
O  1.566519 -1.02069 -0.093517
O  -0.789471 -2.451367 -0.453139
C  -3.868143 -1.262608 -0.324459
C  -4.617452 2.409838 -0.661875
C  -4.622868 0.952358 -1.138859
C  -3.218106 2.901292 -0.227279
C  -3.129808 -1.790917 0.910573
C  -5.07535 -2.162134 -0.659828
C  -3.238102 4.346027 0.315215
C  -0.753648 -1.518568 0.368859
C  0.44122 -0.649167 0.753094
C  2.761732 -0.325749 0.106414
C  3.854674 -0.687152 -0.72753
C  2.954399 0.698683 1.068016
C  5.103583 -0.052999 -0.61474
C  4.204072 1.346018 1.193699
C  5.26025 0.961897 0.3512
H  -3.169824 -1.239523 -1.189251
H  -5.006192 3.049977 -1.480289
H  -5.324994 2.505112 0.185318
H  -5.623273 0.670105 -1.53174
H  -3.873922 0.803285 -1.950067
H  -2.526492 2.838602 -1.09323
H  -2.829332 2.208452 0.542621
H  -2.930865 -2.872245 0.808819
H  -3.7098 -1.575098 1.821113
H  -4.743164 -3.180354 -0.93325
H  -5.639475 -1.751852 -1.51526
H  -5.762932 -2.230016 0.202311
H  -3.893262 4.425103 1.203318
H  -2.226947 4.680683 0.61187
H  -3.617793 5.054751 -0.445412
H  0.671949 -0.814364 1.825097
H  0.163484 0.4151 0.615949
H  2.137486 1.004253 1.727444
H  5.930125 -0.346677 -1.266225
H  4.344113 2.135085 1.937247
