program: Gaussian 09
title: 000124212
version: EM64L-G09RevD.01
frameworkgroup: C1[X(C19H26N4O10S)]
method: RPBEPBE
basis: SDD
operation: Freq
keyword: #p
keyword: freq=noraman
keyword: PBEPBE/SDD
title: #p freq=noraman PBEPBE/SDD
converged: NO YES NO NO
title: Mulliken charges:
elementType: S O O O O O O O O O O N N N N C C C C C C C C C C C C C C C C C C C H H H H H H H H H H H H H H H H H H H H H H H H H H
charge: 0.155502 -0.275110 -0.218942 -0.382677 -0.412278 -0.411361 -0.242784 -0.418975 -0.402490 -0.265112 -0.224189 -0.200523 -0.596605 -0.609922 -0.544087 -0.193528 -0.366250 -0.509594 -0.218665 -0.701526 0.287874 0.272095 -0.620938 0.608959 -0.215655 -0.499431 -0.371527 -0.429149 -0.630642 0.206517 0.221448 0.149342 0.173425 0.207801 0.279500 0.255852 0.226317 0.259392 0.295510 0.258228 0.262618 0.294292 0.239138 0.262705 0.260169 0.317646 0.327645 0.287431 0.229724 0.300400 0.298968 0.343896 0.265502 0.277209 0.273963 0.347591 0.354027 0.374878 0.399165 0.387233
chargesum: 0.00000
title: Mulliken charges with hydrogens summed into heavy atoms:
elementType: S O O O O O O O O O O N N N N C C C C C C C C C C C C C C C C C C C
charge: 0.155502 -0.275110 -0.218942 -0.035086 -0.058251 -0.036483 -0.242784 -0.019810 -0.015257 -0.265112 -0.224189 -0.200523 0.002763 -0.000524 0.007085 0.085971 0.115920 0.045308 0.039562 -0.144617 0.287874 0.272095 -0.119095 0.608959 0.044514 0.145860 -0.371527 -0.141718 -0.400918 0.206517 0.221448 0.149342 0.173425 0.207801
polarizability: 3.53958880e+02 3.18733164e+00 3.09540421e+02 -2.80448885e+00 -4.55665268e+00 2.15600645e+02
1716.lowfreq: -5.9147 -4.9854 -0.0016 -0.0010 -0.0008 4.8706 10.7964 20.4378 22.4695
frequency: 9.9221 20.2223 22.4443 25.2537 32.3684 37.2999 42.0210 47.2403 54.6101 58.4975 71.2332 73.5972 80.1462 96.6524 101.6472 105.3259 118.2993 130.0429 137.6611 145.0984 155.0721 165.7579 187.4070 207.8684 219.5950 231.0623 234.9050 246.6225 252.3470 256.8312 269.5416 281.9653 298.8395 301.6765 308.3902 316.2017 321.1852 331.6824 335.5580 340.9490 346.3700 352.8884 375.5835 388.6143 390.6425 404.7457 416.0478 431.5617 456.1075 491.1585 493.1936 499.5940 540.8230 543.1193 557.4638 559.4110 579.2712 582.9769 597.9115 611.5783 625.6213 633.0624 637.9672 644.8014 646.7780 668.2987 690.4434 695.1610 701.8779 713.3565 728.1497 740.0780 743.1116 748.2597 769.8831 786.4812 792.0658 803.3722 826.9733 842.5721 855.0197 859.5769 865.8563 906.4405 911.0876 922.3270 948.1844 971.9398 981.1328 992.3885 1015.8907 1019.7887 1048.7635 1055.2797 1064.0082 1078.7393 1082.6131 1087.9859 1109.5616 1115.8296 1117.1954 1147.3658 1152.1246 1155.9022 1162.2058 1163.5132 1168.1196 1188.0566 1192.0409 1210.4525 1224.0164 1231.8930 1235.9828 1251.2281 1270.3872 1272.0385 1277.4345 1288.9210 1306.2509 1316.6441 1319.0604 1322.8482 1325.2174 1338.0005 1362.0802 1365.3935 1373.0163 1377.9810 1385.7034 1389.7712 1400.1008 1419.6631 1422.3033 1430.4428 1445.8748 1451.7027 1479.2789 1479.9576 1596.2603 1600.6005 1617.4792 1620.4308 1624.1585 1642.2002 1643.2369 1648.9101 1674.2204 1679.5507 2992.9202 2995.4812 3003.1196 3017.1955 3031.0240 3036.7859 3038.0400 3045.7974 3052.6895 3073.3398 3083.3831 3092.3243 3100.2701 3116.8122 3163.3088 3188.0721 3360.5200 3421.9323 3432.3294 3452.7888 3490.7809 3521.3517 3554.2899 3573.4104 3575.4784 3580.8190
redmass: 7.9445 7.4959 7.4667 9.5485 7.7001 8.2372 7.1000 8.3743 7.5020 8.1135 7.7620 5.3110 5.7465 6.3492 6.5857 8.5866 7.5622 6.8001 6.3851 2.7845 4.4503 4.1159 7.2081 4.1833 4.4910 1.5758 3.4317 4.2092 4.0295 4.3866 5.5388 4.0380 4.1138 4.1903 2.3267 2.6209 2.7883 1.4334 1.2182 1.3560 3.7620 6.2128 3.3767 4.9281 3.8736 6.5552 4.8968 5.2633 5.8255 2.8841 2.8042 2.5888 3.1328 4.1426 4.0626 3.3982 1.1317 5.4122 1.7398 3.5862 2.5382 1.5472 4.6447 1.8340 3.0322 3.7194 3.3799 1.6540 1.4991 3.7000 4.2457 4.6211 4.4742 2.1567 4.7487 2.7443 3.7119 2.0344 6.1188 1.3481 4.3488 1.7477 3.3404 1.4241 1.6770 3.0787 2.4391 2.8603 2.8648 2.6185 3.1349 3.0969 2.3723 2.2792 2.4447 2.6357 2.5093 3.3001 2.2319 1.4880 1.9241 1.6248 1.8864 1.7967 1.5460 1.3835 1.5058 1.4489 1.4478 1.5984 2.0490 1.5200 1.9285 1.2449 1.5561 1.6552 1.3009 2.7780 1.2952 1.4968 1.4747 1.6035 1.5500 1.3281 1.1679 1.3670 1.5843 1.5776 2.0427 1.8206 5.6026 1.1195 3.3071 1.1041 1.0775 1.0906 1.2331 2.9323 5.9395 6.1153 6.3624 6.5740 7.4567 3.8979 1.4095 1.1275 8.3702 1.0862 1.0676 1.0616 1.0597 1.0629 1.0598 1.0830 1.0839 1.0974 1.0876 1.1017 1.0945 1.1020 1.0911 1.1079 1.0929 1.0674 1.0638 1.0510 1.0451 1.0449 1.0640 1.0643 1.0961 1.0940 1.0660 1.0986
irintensity: 1.8647 0.3091 0.2716 0.2559 0.0519 0.7858 0.2004 2.0970 1.0411 1.1610 0.5245 0.8870 0.8727 0.3541 0.1248 0.3832 11.5827 3.8993 0.8582 3.8960 1.3034 0.8913 0.7038 3.0422 10.9085 14.4911 15.3364 1.6930 14.7628 7.4323 18.0065 19.3200 9.3880 3.7814 27.9041 36.5876 27.1558 13.9131 108.0413 72.7736 23.9308 2.1863 13.1754 2.0537 4.0330 2.9362 6.7893 10.1567 4.1008 14.1779 21.1283 22.4912 52.3404 9.3651 7.8815 47.3882 124.6548 2.2431 91.6821 8.4382 82.4018 61.9682 13.1214 106.7286 9.6083 29.9463 150.2288 248.1794 212.8498 47.5044 4.0379 13.7293 14.8265 47.8483 20.9934 38.2191 21.1644 34.9509 17.6133 152.6649 9.7240 33.8169 37.8645 3.1362 24.6032 9.4241 4.3653 2.0432 49.7480 32.7092 170.4195 193.1222 124.7116 233.5846 5.2783 55.0536 77.3671 22.9729 56.6370 53.5572 95.2773 60.9617 123.3012 26.9365 313.5953 197.0883 76.1007 45.5787 11.3602 23.9280 22.1056 5.0205 18.6311 9.2133 30.5660 4.9393 5.0634 48.6010 1.8149 6.0840 19.2302 26.0909 44.9606 5.4430 3.4965 7.9681 5.2138 25.4090 75.8324 29.2531 8.7289 56.1285 17.7100 29.6875 88.4472 17.0916 10.2478 89.4758 250.8283 40.9963 70.9812 173.4062 292.1730 189.1943 97.2122 74.1470 165.5442 49.1227 47.8051 11.9002 17.7845 6.7083 14.3969 8.7721 31.4522 2.1225 12.0627 8.8605 14.1160 10.8109 19.7877 5.6787 1.3895 852.1262 88.0348 174.2925 1.1627 11.1797 11.5291 43.2267 2.5607 59.7100 35.9855 9.1468
temp: 298.150 k
press: 1.00000 atm
elementType: 16 8 8 8 8 8 8 8 8 8 8 7 7 7 7 6 6 6 6 6 6 6 6 6 6 6 6 6 6 6 6 6 6 6 1 1 1 1 1 1 1 1 1 1 1 1 1 1 1 1 1 1 1 1 1 1 1 1 1 1
symmnumber: 1
zpe: 1198564.4 jmol-1
zpe.correction: 0.456509 hartree
zpe.thermalcorrener: 0.493067 hartree
zpe.thermalcorrenthalpy: 0.494012 hartree
zpe.thermalcorrgfe: 0.384209 hartree
zpe.sumelectzpe: -2106.367454 hartree
zpe.sumelectthermal: -2106.330896 hartree
zpe.sumelectthermalent: -2106.329952 hartree
zpe.sumelectthermalfe: -2106.439754 hartree
dipole: -1.4698 -2.7220 -1.6768
dipole: 3.5187
quadrupole: -198.7776 -199.7219 -199.6717
quadrupole: 30.8713 -6.5235 14.4706
quadrupole: 0.6128 -0.3315 -0.2813 30.8713 -6.5235 14.4706
hfenergy: -2106.8239632 hartree
pointgroup: C01 [X(C19H26N4O10S1)]
dipole: -0.6447424 0.9726835 0.7447391 debye
polarizability: 354.0875575|1.255|309.5470423|-4.3228746|0.2863076|215.4653463 unknown
InChI: InChI=1S/C19H26N4O10S/c20-9(18(30)31)1-2-14(25)23(6-15(26)27)17(29)11(22)7-34-13-5-8(3-10(21)19(32)33)4-12(24)16(13)28/h4-5,9-11,24,26,28,30,32H,1-3,6-7,20-22H2
charge 0 multiplicity 1
60 atoms
S  -0.147944 2.457414 -1.113493
O  -0.796046 0.190596 1.653552
O  -4.261516 -1.817656 0.600354
O  2.235534 4.381582 -1.140207
O  4.878904 3.774492 -0.815208
O  -0.722049 -3.258361 -3.40271
O  0.805716 -2.394124 -1.887669
O  1.812626 -0.236898 2.102725
O  -6.206779 1.687265 -0.039654
O  1.437303 -2.437338 1.481361
O  -4.271163 1.32516 -1.280068
N  -3.038092 0.108641 1.025231
N  -2.334032 2.858474 2.485467
N  -0.089592 -4.508336 0.003506
N  4.340714 -2.796344 1.426885
C  -1.870816 2.339879 1.175382
C  -2.18345 -3.276412 -0.604135
C  -1.849964 -2.012832 0.217592
C  -0.917713 -4.039745 -1.102233
C  -0.494196 2.881811 0.735682
C  -1.846175 0.795466 1.292825
C  -3.118723 -1.29636 0.64207
C  3.798946 -1.111089 -0.309523
C  3.382514 0.316684 -0.615153
C  3.701443 -1.488226 1.2159
C  -4.334862 0.805428 1.149369
C  1.636165 1.990213 -0.972024
C  2.023079 0.642532 -0.830176
C  4.336931 1.365319 -0.605366
C  2.589912 3.042012 -0.979098
C  3.961168 2.711963 -0.799912
C  -0.166655 -3.149278 -2.118854
C  2.218166 -1.460075 1.624297
C  -4.882707 1.273749 -0.194015
H  -2.620099 2.621833 0.414146
H  -2.757683 -3.982241 0.018951
H  -2.812791 -3.009458 -1.473076
H  -1.208119 -1.315099 -0.352573
H  -1.260978 -2.273696 1.117347
H  -1.286401 -4.913175 -1.669943
H  -0.476211 3.979246 0.84361
H  0.325623 2.43086 1.317384
H  4.856568 -1.285922 -0.576118
H  3.177426 -1.82697 -0.880187
H  4.23776 -0.722037 1.801618
H  -5.063823 0.103876 1.587279
H  -4.219067 1.662314 1.83952
H  1.271593 -0.151144 -0.868596
H  5.397169 1.125074 -0.441549
H  -2.580529 3.853411 2.482272
H  -1.720116 2.613008 3.270072
H  0.393038 -3.780729 0.547692
H  0.525367 -5.290092 -0.234982
H  3.831755 -3.553517 0.953334
H  4.4865 -3.022236 2.417624
H  1.257353 4.404856 -1.355781
H  5.798287 3.430963 -0.686817
H  -0.249205 -2.641478 -4.026798
H  0.806132 -0.127426 2.076566
H  -6.567192 1.994974 -0.9150
