program: Gaussian 09
title: 000123915
version: EM64L-G09RevD.01
frameworkgroup: C1[X(C8H17NO3)]
method: RPBEPBE
basis: SDD
operation: Freq
keyword: #p
keyword: freq=noraman
keyword: PBEPBE/SDD
title: #p freq=noraman PBEPBE/SDD
converged: YES YES NO NO
title: Mulliken charges:
elementType: O O O N C C C C C C C C H H H H H H H H H H H H H H H H H
charge: -0.485585 -0.471646 -0.209929 -0.575229 -0.085603 -0.467843 0.010534 -0.078763 -0.504032 -0.737188 -0.722958 0.202522 0.217547 0.197347 0.196760 0.187211 0.190510 0.243303 0.253300 0.211700 0.205029 0.235835 0.194624 0.201993 0.262546 0.252770 0.302286 0.379514 0.393446
chargesum: 0.00000
title: Mulliken charges with hydrogens summed into heavy atoms:
elementType: O O O N C C C C C C C C
charge: -0.106071 -0.078200 -0.209929 -0.020174 0.131944 -0.073736 0.197745 0.111747 -0.007430 -0.084624 -0.063796 0.202522
polarizability: 1.36031274e+02 -5.64642086e+00 1.03653650e+02 -7.68439026e-01 1.92859950e+00 8.42320232e+01
1716.lowfreq: -13.2189 -1.0879 0.0003 0.0006 0.0006 6.0068 21.1860 41.0835 62.6270
frequency: 16.5873 40.8948 62.5843 78.0937 94.3664 162.4390 186.5275 205.4933 227.3419 265.3307 316.3532 321.3744 330.0434 353.6166 362.5380 387.5128 416.9637 457.9183 473.9555 523.6205 555.6764 564.7758 609.9320 680.3390 750.1270 780.2786 812.2806 850.5468 856.6341 910.5461 929.5086 960.3847 963.0135 989.3473 1016.1236 1030.8410 1064.0327 1092.7464 1101.3148 1158.7113 1172.2698 1187.1338 1203.1801 1230.0177 1254.8171 1282.7244 1293.4717 1297.8698 1310.5862 1332.4906 1337.3439 1360.5331 1373.1212 1376.4963 1390.5256 1391.8350 1424.2742 1455.5852 1463.6706 1474.9560 1489.3172 1497.6960 1644.5444 1679.8380 2926.2609 2942.1682 2955.8658 2966.5132 2971.8838 2982.5210 3004.8281 3018.3631 3053.9677 3062.3262 3073.4867 3089.8407 3099.8833 3415.0705 3479.9707 3519.7449 3538.4511
redmass: 3.3041 7.1636 4.3658 4.5850 2.8431 2.9303 3.5492 4.7129 1.1370 1.0561 1.4642 2.2350 2.6333 5.0102 2.1653 2.4308 2.1152 3.2703 2.1276 1.1281 3.0303 2.1579 1.3937 3.0302 1.6386 3.1190 5.4122 2.1091 2.0472 1.4062 1.6074 1.5399 2.3666 2.3588 2.3602 4.3573 1.5835 2.1225 1.6834 2.0577 1.2873 1.6749 1.8409 1.2155 1.6879 1.3778 1.2452 1.3437 1.3106 1.4119 1.4331 1.2293 1.2394 1.4767 1.3529 1.2775 1.0921 1.0805 1.0495 1.0530 1.0491 1.0541 1.0876 8.6923 1.0831 1.0728 1.0710 1.0366 1.0399 1.0824 1.0641 1.0953 1.0990 1.0984 1.0998 1.0993 1.0964 1.0445 1.0656 1.0641 1.0957
irintensity: 0.0884 3.0301 0.5956 1.1468 0.3231 0.7585 2.7899 1.7351 6.7996 0.6553 26.3549 16.8475 6.7947 8.0920 8.4691 2.2696 3.1250 21.1515 13.9621 65.4484 53.1646 43.2463 167.6518 43.7344 261.7341 15.1346 44.4494 21.3761 4.1536 5.5935 6.2421 5.4712 51.9695 8.0083 11.2310 20.6409 6.0091 250.5409 28.8536 17.0420 5.9335 3.9309 10.5451 6.9477 53.9672 5.3035 10.0909 7.0854 16.3659 29.7341 3.6359 19.6546 13.2626 4.8070 49.3217 7.1619 13.8964 1.4298 6.0574 7.8400 13.1170 17.9890 54.6716 308.3399 37.7273 19.7179 47.3168 62.4397 15.9859 56.1218 6.4388 55.6654 42.1105 65.7101 35.7717 24.9710 8.7137 4.2822 89.0767 26.0586 5.1981
temp: 298.150 k
press: 1.00000 atm
elementType: 8 8 8 7 6 6 6 6 6 6 6 6 1 1 1 1 1 1 1 1 1 1 1 1 1 1 1 1 1
symmnumber: 1
zpe: 651882.0 jmol-1
zpe.correction: 0.248289 hartree
zpe.thermalcorrener: 0.262801 hartree
zpe.thermalcorrenthalpy: 0.263745 hartree
zpe.thermalcorrgfe: 0.205793 hartree
zpe.sumelectzpe: -594.476554 hartree
zpe.sumelectthermal: -594.462041 hartree
zpe.sumelectthermalent: -594.461097 hartree
zpe.sumelectthermalfe: -594.519049 hartree
dipole: 1.4982 0.1943 -0.6739
dipole: 1.6543
quadrupole: -70.9451 -81.1979 -73.7908
quadrupole: 10.0938 2.7851 -5.1054
quadrupole: 4.3661 -5.8866 1.5205 10.0938 2.7851 -5.1054
hfenergy: -594.7248422 hartree
pointgroup: C01 [X(C8H17N1O3)]
dipole: 0.5992442 0.124023 -0.2216506 debye
polarizability: 135.5884573|-6.7736342|101.5117977|-1.1911317|6.9061514|86.8166924 unknown
InChI: InChI=1S/C8H17NO3/c1-5(2)3-6(9)7(10)4-8(11)12/h5-7,10-11H,3-4,9H2,1-2H3
charge 0 multiplicity 1
29 atoms
O  1.280578 1.492821 0.979232
O  3.634406 0.184129 0.371546
O  3.454363 -1.741808 -0.913373
N  -1.368793 1.756562 0.508839
C  -0.787219 0.411142 0.333245
C  -1.525788 -0.374322 -0.777768
C  -3.010365 -0.770787 -0.508153
C  0.753962 0.48263 0.05101
C  1.461817 -0.884475 0.292149
C  -3.1904 -1.462282 0.86437
C  -4.001809 0.408506 -0.660465
C  2.904383 -0.912779 -0.162589
H  -0.893182 -0.126282 1.297781
H  -1.47866 0.217352 -1.718359
H  -0.965515 -1.309817 -0.976339
H  -3.264192 -1.517159 -1.292424
H  0.920095 0.810001 -1.001379
H  0.944594 -1.702568 -0.233239
H  1.422993 -1.086874 1.380485
H  -4.212833 -1.872478 0.960515
H  -2.47691 -2.298432 0.997976
H  -3.040904 -0.742184 1.689307
H  -3.909505 0.88232 -1.657269
H  -5.044624 0.053857 -0.55298
H  -3.803988 1.175572 0.107323
H  -1.54527 2.228705 -0.387293
H  -0.773074 2.334283 1.116525
H  2.274472 1.442938 0.955849
H  4.575869 0.147729 0.051577
