program: Gaussian 09
title: 000123849
version: EM64L-G09RevD.01
frameworkgroup: C1[X(C13H20N2O3)]
method: RPBEPBE
basis: SDD
operation: Freq
keyword: #p
keyword: freq=noraman
keyword: PBEPBE/SDD
title: #p freq=noraman PBEPBE/SDD
converged: YES YES NO NO
title: Mulliken charges:
elementType: O O O N N C C C C C C C C C C C C C H H H H H H H H H H H H H H H H H H H H
charge: -0.446521 -0.194886 -0.197831 -0.184062 -0.259700 0.364350 0.364372 -0.057192 -0.481896 -0.481903 -0.771367 -0.743245 -0.771380 -0.743289 0.163354 0.195954 -0.260744 -0.271824 0.253986 0.255399 0.206543 0.206546 0.255397 0.208294 0.230741 0.229744 0.210445 0.251442 0.214218 0.208293 0.230742 0.229745 0.210434 0.251461 0.214234 0.360911 0.274507 0.274731
chargesum: 0.00000
title: Mulliken charges with hydrogens summed into heavy atoms:
elementType: O O O N N C C C C C C C C C C C C C
charge: -0.085611 -0.194886 -0.197831 -0.184062 -0.259700 0.364350 0.364372 0.196794 -0.019954 -0.019961 -0.102588 -0.067140 -0.102600 -0.067161 0.163354 0.195954 0.013762 0.002907
polarizability: 1.79784217e+02 -2.81074584e-04 1.32390585e+02 5.54903117e+00 -5.68147668e-03 1.63135605e+02
1716.lowfreq: -9.1411 -8.0768 -0.0007 -0.0005 0.0006 3.7501 32.3975 64.7127 73.4082
frequency: 32.3286 64.6800 73.4050 127.9873 134.8846 140.5900 177.6530 187.5045 207.3416 230.3793 252.4177 257.2248 264.2470 265.9605 285.4600 293.1053 305.3284 312.5060 334.9199 342.0467 354.5264 373.1448 406.5404 424.6172 452.0400 453.7540 528.4127 529.0762 555.8632 575.5008 614.4619 629.5335 630.4778 689.8476 738.7182 764.8527 785.5402 822.0777 839.1870 863.5186 869.0632 901.5059 922.5214 930.7911 931.5623 940.6483 961.6904 981.3783 982.5552 991.3870 1017.8695 1029.4708 1043.9143 1086.3442 1105.1217 1115.6085 1123.8621 1176.8562 1188.1305 1207.5232 1219.3412 1229.0310 1257.1865 1258.2146 1282.9166 1292.9286 1302.6874 1330.0282 1341.4471 1345.6009 1363.2945 1367.2475 1380.3444 1387.2648 1393.7067 1447.8775 1457.3670 1457.7856 1470.8782 1471.3000 1472.6645 1480.8811 1488.4952 1492.3613 1501.0167 1582.4942 1616.0803 1671.4176 2982.6197 2982.9553 2991.4639 2993.4627 2998.8302 3001.3226 3015.7187 3061.8179 3068.9147 3076.8483 3081.0802 3083.7478 3087.0965 3092.2130 3092.6579 3103.3089 3109.1352 3204.1482 3232.8528 3554.0963
redmass: 6.3377 5.0588 4.3930 4.0889 2.8733 5.8759 1.0370 4.8630 5.6727 2.5692 1.0334 1.0388 1.4744 2.4703 3.2231 4.2352 3.8151 2.0913 1.5027 2.4175 2.0156 2.5904 7.2125 2.5195 2.3913 2.9576 2.6515 3.3235 4.0546 3.5308 5.6883 5.5670 2.2950 8.1139 7.1179 5.2135 3.1058 2.0571 2.8808 1.5499 2.8125 4.2572 1.5932 1.7867 1.4977 1.3117 1.9050 1.6098 1.4289 2.3409 2.1433 1.7213 1.6391 1.3257 2.7122 3.1118 2.7327 2.8670 2.4127 3.0400 2.3886 1.6502 1.9263 2.2231 1.7230 1.3622 1.5159 1.4904 7.8900 1.3544 1.2036 1.2347 1.2028 1.2213 1.3488 1.0685 1.0624 1.0621 1.0788 1.0521 1.0602 1.0502 1.0522 1.0605 1.0529 6.9707 11.0901 11.0583 1.0351 1.0352 1.0368 1.0385 1.0579 1.0591 1.0829 1.1037 1.1022 1.0994 1.0987 1.0989 1.0966 1.1005 1.1004 1.0998 1.0993 1.0894 1.1108 1.0680
irintensity: 0.0464 0.2242 1.8782 1.0130 0.3583 9.5450 0.5160 1.4310 2.7694 0.2660 6.6760 0.0560 0.0388 0.1184 4.3134 0.0578 9.4226 1.0824 99.7428 2.5430 6.2112 2.1165 24.5593 0.2587 0.1596 0.0148 1.3620 0.5537 4.3233 14.5128 6.5471 4.3508 2.8888 38.1732 0.0078 0.4598 2.5724 69.6103 15.3827 1.1377 21.5707 19.1418 1.3058 0.0346 5.2603 0.0017 3.3067 5.5981 1.0692 2.2311 0.6853 24.6507 1.2906 11.3590 33.5065 2.1925 19.5597 39.5713 10.2499 46.9651 12.0641 64.9333 4.4183 13.6894 0.6958 11.6013 14.9162 13.5467 303.0148 1.6623 0.0839 59.5867 33.8904 19.6455 4.3880 5.4171 1.6275 0.3656 15.4842 2.8546 0.3018 7.3443 15.9344 15.4130 2.5772 5.4230 396.0439 3.1580 24.2774 24.7026 10.5935 25.0561 46.0162 4.1934 9.2508 5.9051 6.0594 19.4255 31.9273 67.7781 9.7450 9.2179 40.4788 3.2019 42.7399 0.0082 1.3370 19.2484
temp: 298.150 k
press: 1.00000 atm
elementType: 8 8 8 7 7 6 6 6 6 6 6 6 6 6 6 6 6 6 1 1 1 1 1 1 1 1 1 1 1 1 1 1 1 1 1 1 1 1
symmnumber: 1
zpe: 825456.9 jmol-1
zpe.correction: 0.314400 hartree
zpe.thermalcorrener: 0.332814 hartree
zpe.thermalcorrenthalpy: 0.333758 hartree
zpe.thermalcorrgfe: 0.269802 hartree
zpe.sumelectzpe: -841.119584 hartree
zpe.sumelectthermal: -841.101170 hartree
zpe.sumelectthermalent: -841.100226 hartree
zpe.sumelectthermalfe: -841.164182 hartree
dipole: 1.1625 0.0002 -0.8118
dipole: 1.4179
quadrupole: -93.0712 -105.0584 -121.9339
quadrupole: 0.0004 0.9282 0.0026
quadrupole: 13.6166 1.6294 -15.2461 0.0004 0.9282 0.0026
hfenergy: -841.4339841 hartree
pointgroup: C01 [X(C13H20N2O3)]
dipole: 0.4557535 -0.000269 -0.3216547 debye
polarizability: 179.8392183|-0.000836|132.3905997|5.4656238|0.0218804|163.0805885 unknown
InChI: InChI=1S/C13H20N2O3/c1-12(2)7-9(8-13(3,4)15(12)18)14-10(16)5-6-11(14)17/h5-6,9,18H,7-8H2,1-4H3
charge 0 multiplicity 1
38 atoms
O  -3.872954 0.000019 -0.146108
O  2.532022 0.001106 2.32076
O  1.933147 -0.002349 -2.344256
N  -2.403123 -0.00044 -0.49455
N  1.829915 -0.000528 0.043979
C  -1.829454 -1.3119 0.006869
C  -1.829129 1.311678 0.004798
C  0.366974 -0.000166 0.284422
C  -0.303439 -1.264757 -0.29452
C  -0.303128 1.263684 -0.296499
C  -2.464341 -2.425766 -0.863446
C  -2.113469 -1.634564 1.503357
C  -2.463727 2.4243 -0.867325
C  -2.113112 1.63685 1.500759
C  2.793155 0.000111 1.092074
C  2.485204 -0.001567 -1.214502
C  4.146836 -0.000452 0.428217
C  3.966756 -0.001456 -0.919968
H  0.277138 0.000702 1.387129
H  -0.150466 -1.281747 -1.388989
H  0.162354 -2.17257 0.132888
H  0.162883 2.172055 0.12948
H  -0.150148 1.278908 -1.390994
H  -1.945937 -3.387091 -0.693821
H  -3.529497 -2.56039 -0.607383
H  -2.384369 -2.16655 -1.934011
H  -1.481952 -1.060339 2.200958
H  -3.171702 -1.423577 1.732677
H  -1.926081 -2.707685 1.691229
H  -1.945159 3.385791 -0.699147
H  -3.528881 2.559525 -0.611566
H  -2.383704 2.163398 -1.937478
H  -1.481398 1.063997 2.199311
H  -3.171285 1.426016 1.730509
H  -1.925956 2.710336 1.686746
H  -4.297269 -0.000619 -1.042538
H  5.071111 -0.000065 1.006016
H  4.708188 -0.002098 -1.719076
