program: Gaussian 09
title: 000123879
version: EM64L-G09RevD.01
frameworkgroup: C1[X(C21H21FN2O4S)]
method: RPBEPBE
basis: SDD
operation: Freq
keyword: #p
keyword: freq=noraman
keyword: PBEPBE/SDD
title: #p freq=noraman PBEPBE/SDD
converged: YES YES NO NO
title: Mulliken charges:
elementType: S F O O O O N N C C C C C C C C C C C C C C C C C C C C C H H H H H H H H H H H H H H H H H H H H H
charge: 0.934043 -0.193359 -0.533009 -0.530430 -0.409333 -0.232924 -0.239421 -0.536106 -0.150935 -0.528214 0.169700 0.130475 -0.410474 -0.510976 0.145989 0.211077 -0.434376 -0.416466 -0.364458 -0.488155 -0.251362 -0.236298 -0.021001 0.189728 -0.197981 -0.216600 -0.341601 -0.341085 0.336770 0.269512 0.256471 0.223349 0.219951 0.227912 0.223576 0.248923 0.328771 0.253514 0.251032 0.237859 0.233583 0.266641 0.284546 0.221805 0.221149 0.284175 0.292981 0.270003 0.269946 0.381083
chargesum: 0.00000
title: Mulliken charges with hydrogens summed into heavy atoms:
elementType: S F O O O O N N C C C C C C C C C C C C C C C C C C C C C
charge: 0.934043 -0.193359 -0.533009 -0.530430 -0.028250 -0.232924 -0.239421 -0.207335 0.118577 -0.048394 0.169700 0.130475 0.037389 -0.038477 0.145989 0.211077 0.070171 -0.178607 -0.130875 0.063032 -0.029557 -0.015150 -0.021001 0.189728 0.086194 0.076381 -0.071598 -0.071138 0.336770
polarizability: 3.46167940e+02 -3.83052910e+01 2.86822080e+02 2.73645408e+01 5.25530070e+00 2.13629876e+02
1716.lowfreq: -8.2555 -2.7250 0.0010 0.0016 0.0019 2.4733 8.4478 10.0552 12.8028
frequency: -8.0202 9.8834 12.6283 23.9424 28.2630 34.9605 38.6945 66.2604 83.8687 90.2036 117.0556 123.1409 151.6656 156.0888 170.0590 178.1227 197.4509 224.8932 229.3037 242.8068 260.1901 282.2237 308.8602 313.2519 332.0884 346.4563 377.2952 389.6604 404.5905 411.4609 413.7455 430.1373 445.0296 455.7025 477.6039 502.0920 514.8973 520.0062 548.0954 558.3094 577.0900 579.4070 584.3252 614.0621 614.4955 636.9063 641.9324 682.7318 709.5509 713.6702 747.8622 757.5477 763.3818 779.2557 796.6628 800.4286 817.9050 819.7735 837.7220 842.4908 847.7876 878.6122 883.1682 889.3993 929.0814 936.9853 951.3381 952.5638 968.3124 971.5609 978.4978 990.4062 995.1162 1013.0058 1016.7894 1044.7723 1047.6351 1060.9874 1075.5720 1081.3693 1098.0309 1100.4102 1123.6679 1147.0465 1153.0063 1157.9468 1170.3624 1185.8430 1194.6208 1199.1684 1211.6684 1240.8868 1244.2541 1259.9965 1276.0257 1277.7772 1284.7794 1307.1250 1319.8225 1325.7704 1341.7191 1348.5928 1373.5465 1382.7971 1387.0773 1392.4313 1394.4078 1410.2820 1428.6555 1441.7558 1447.2828 1463.0513 1464.4827 1465.0860 1468.9635 1478.0714 1481.8009 1578.5653 1586.1558 1588.4606 1608.9870 1624.9331 1661.9465 2958.0586 2966.1299 2993.2566 3007.9930 3009.4479 3026.4928 3027.4199 3032.7756 3056.1220 3072.8990 3090.6223 3122.7325 3130.4182 3144.2430 3160.1253 3162.4292 3163.0744 3183.6854 3186.2987 3316.0327 3509.4585
redmass: 6.7872 12.4471 7.9735 5.7966 6.2783 5.0788 6.6804 5.7358 2.3734 5.2419 7.4657 6.3448 6.7144 4.2305 4.1661 4.0575 5.4579 5.4497 8.2763 5.1451 2.5012 4.8636 4.7413 3.9831 4.8598 6.2727 3.4035 5.2135 5.3813 4.7117 3.0456 2.9471 4.5135 4.1673 5.0495 1.8439 4.1581 3.2560 5.1935 4.5282 3.9564 8.0688 4.2091 6.8212 4.7712 4.3203 1.3115 4.4549 3.7162 2.8806 1.3094 3.9523 1.7676 6.7506 2.6778 11.9464 2.0502 1.3856 2.3467 1.5376 1.4429 3.1281 2.6635 2.3175 1.3897 7.9279 1.3631 2.3162 1.3494 1.3115 2.3161 3.0817 4.2699 2.1603 3.2762 2.5172 3.0608 2.2119 2.0262 2.4118 1.6953 1.2984 1.5271 1.2032 1.2740 1.3811 1.2510 1.4318 2.9923 1.9002 1.3096 1.6289 1.5744 1.3384 1.4012 1.2477 1.2277 1.5347 1.5422 1.7476 1.4461 2.1535 1.9657 1.4506 1.5528 10.5987 3.2641 5.2765 3.4754 1.0980 1.1548 1.6396 2.3580 1.6517 1.0998 3.6972 1.1902 6.6923 7.0182 6.2711 8.3299 7.4723 8.2799 1.0607 1.0649 1.0764 1.0616 1.0841 1.0962 1.0615 1.0854 1.0988 1.1016 1.1033 1.0852 1.0888 1.0949 1.0900 1.1000 1.0900 1.0963 1.0974 1.0737 1.0640
irintensity: 0.3698 1.1667 0.0675 0.2743 0.0303 0.2263 0.0395 0.8757 0.3424 1.1344 1.5916 4.6710 0.6553 0.9092 1.3328 14.2175 1.8011 7.7537 4.0324 3.0062 0.8819 3.4769 4.5144 1.8880 0.3842 10.5150 20.0043 6.3305 28.6585 16.7483 0.7526 5.2298 36.1599 51.2791 52.6814 26.2329 1.6679 83.5603 49.3623 1.9513 0.0561 18.9002 1.5311 0.1848 0.6882 1.8544 123.0899 5.0190 0.3600 10.3668 98.0425 1.4355 10.4456 14.0977 26.8260 78.8406 60.7339 10.8734 29.4597 66.9347 0.4054 19.0593 19.8518 8.2353 1.1872 42.4764 0.5558 3.5510 0.1513 0.0194 1.8562 14.6024 2.8107 14.4101 124.6787 12.4041 33.5324 4.9617 23.8049 145.0067 4.1834 8.5345 2.9489 11.3859 66.1963 6.3383 15.2276 17.6003 64.7835 5.1108 25.7484 7.1261 4.2045 7.6245 18.9741 5.8723 0.8033 8.3519 13.9336 53.8395 11.7172 28.6469 124.3819 27.2282 12.0386 2.6742 6.5031 25.5994 44.2741 22.0648 9.5124 26.4445 103.1808 6.0255 3.7563 14.6948 29.7587 1.8957 4.9488 41.4103 6.6612 5.8220 213.8552 39.1681 27.9820 7.8003 3.7859 48.6712 12.1598 17.9996 27.0469 1.0339 34.9625 10.8153 3.1973 4.9005 33.8156 2.1448 32.8821 0.5750 0.8671 5.6900 48.5624 22.8936
temp: 298.150 k
press: 1.00000 atm
elementType: 16 9 8 8 8 8 7 7 6 6 6 6 6 6 6 6 6 6 6 6 6 6 6 6 6 6 6 6 6 1 1 1 1 1 1 1 1 1 1 1 1 1 1 1 1 1 1 1 1 1
symmnumber: 1
zpe: 1003177.2 jmol-1
zpe.correction: 0.382090 hartree
zpe.thermalcorrener: 0.408181 hartree
zpe.thermalcorrenthalpy: 0.409125 hartree
zpe.thermalcorrgfe: 0.321647 hartree
zpe.sumelectzpe: -1718.887312 hartree
zpe.sumelectthermal: -1718.861221 hartree
zpe.sumelectthermalent: -1718.860277 hartree
zpe.sumelectthermalfe: -1718.947755 hartree
dipole: -1.9659 -4.7080 2.6104
dipole: 5.7310
quadrupole: -167.1414 -184.3507 -176.8176
quadrupole: -1.1989 2.4603 -0.9033
quadrupole: 8.9618 -8.2474 -0.7144 -1.1989 2.4603 -0.9033
hfenergy: -1719.269402 hartree
pointgroup: C01 [X(C21H21F1N2O4S1)]
dipole: -0.580564 -1.8674341 1.1222593 debye
polarizability: 353.7394618|-31.3674703|281.2147999|24.2609892|5.6390002|211.6656353 unknown
InChI: InChI=1S/C21H21FN2O4S/c22-14-5-8-16(9-6-14)29(27,28)23-15-7-10-20-18(13-15)17-3-1-2-4-19(17)24(20)12-11-21(25)26/h1-6,8-9,15,23,25H,7,10-13H2
charge 0 multiplicity 1
50 atoms
S  2.955434 1.521456 -0.464419
F  7.948935 -1.851741 -0.479793
O  3.132299 2.576937 0.772311
O  2.665649 1.99273 -1.996812
O  -6.051729 -3.895504 1.108465
O  -5.008392 -4.099882 -0.95732
N  -2.821273 -0.449473 -0.195001
N  1.601368 0.282376 -0.061639
C  1.027322 0.441617 1.314759
C  -0.075323 1.534852 1.392265
C  -1.579685 -0.309146 0.462635
C  -1.331973 1.043734 0.711967
C  0.473157 -0.945925 1.740087
C  -0.655014 -1.449276 0.798718
C  -2.465094 1.788737 0.201363
C  -3.385288 0.828908 -0.355147
C  -3.469014 -1.709602 -0.566967
C  -2.795139 3.16793 0.1528
C  -4.608464 1.214014 -0.946455
C  -4.482522 -2.17553 0.505772
C  -4.014468 3.557708 -0.436498
C  -4.910973 2.591691 -0.980342
C  4.503167 0.449199 -0.461466
C  -5.170675 -3.464715 0.108469
C  4.770137 -0.333474 -1.597914
C  5.344124 0.509569 0.661606
C  5.943677 -1.117567 -1.604243
C  6.518718 -0.274775 0.656482
C  6.781879 -1.070269 -0.473676
H  1.860774 0.72097 1.9854
H  0.303245 2.469302 0.935856
H  -0.266264 1.772423 2.459003
H  0.081193 -0.846128 2.770738
H  1.297844 -1.679487 1.756271
H  -1.1937 -2.28268 1.29219
H  -0.203322 -1.874595 -0.121276
H  0.888865 0.475014 -0.798179
H  -3.980629 -1.587039 -1.537636
H  -2.698766 -2.484014 -0.717842
H  -2.111823 3.91981 0.563383
H  -5.301674 0.481477 -1.37501
H  -3.985316 -2.325953 1.482159
H  -5.253473 -1.401094 0.677894
H  -4.281008 4.619385 -0.482717
H  -5.850163 2.925618 -1.435351
H  4.095388 -0.315011 -2.458927
H  5.096494 1.168853 1.499378
H  6.209365 -1.745934 -2.458458
H  7.216323 -0.268566 1.49818
H  -6.493588 -4.74033 0.819836
