program: Gaussian 09
title: 000123841
version: EM64L-G09RevD.01
frameworkgroup: C1[X(C14H20N4O3S)]
method: RPBEPBE
basis: SDD
operation: Freq
keyword: #p
keyword: freq=noraman
keyword: PBEPBE/SDD
title: #p freq=noraman PBEPBE/SDD
converged: YES YES NO NO
title: Mulliken charges:
elementType: S O O O N N N N C C C C C C C C C C C C C C H H H H H H H H H H H H H H H H H H H H
charge: 0.893315 -0.546614 -0.551618 -0.354720 -0.146802 -0.208646 -0.614972 -0.636485 -0.416974 -0.388586 -0.388979 -0.388164 -0.404249 0.465630 -0.268431 -0.338467 -0.349837 -0.382337 0.271773 -0.743154 0.064737 0.273244 0.197324 0.237833 0.194040 0.204562 0.196766 0.221469 0.267040 0.188633 0.223788 0.184808 0.250534 0.332383 0.274919 0.251510 0.272650 0.289272 0.351979 0.311766 0.405679 0.303383
chargesum: 0.00000
title: Mulliken charges with hydrogens summed into heavy atoms:
elementType: S O O O N N N N C C C C C C C C C C C C C C
charge: 0.893315 -0.546614 -0.551618 -0.354720 -0.146802 -0.208646 0.048773 0.072577 0.018183 0.010016 0.029256 0.067509 0.004347 0.465630 -0.268431 -0.087932 -0.017455 -0.107418 0.271773 0.070278 0.064737 0.273244
polarizability: 3.87591230e+02 9.90488434e+00 2.28841431e+02 -5.67146229e+00 1.36457806e+00 1.29969329e+02
1716.lowfreq: -6.9839 -3.9244 -0.0008 -0.0005 0.0018 2.3653 25.4868 43.8443 53.2255
frequency: 25.3858 43.8379 53.1933 57.9893 61.4891 75.6141 105.0389 116.4912 125.2336 148.4518 166.1230 177.1223 179.7142 205.4782 219.8625 228.1097 250.2547 256.4039 275.8504 305.7494 317.5144 327.9098 354.0003 364.2422 377.4754 388.8951 421.7436 437.1093 449.3507 466.2772 480.8597 503.2971 511.0216 543.4860 558.6947 564.5253 576.8535 635.2443 647.7209 692.3702 715.7244 737.4568 753.8595 789.3104 802.3267 827.8744 840.6752 844.8302 852.2167 879.1334 888.4433 913.3344 925.1275 928.9457 948.1355 954.5477 957.9415 989.8281 993.6917 1010.6542 1022.1974 1034.4990 1058.9222 1077.6816 1082.4232 1121.3196 1128.5813 1139.2413 1157.4626 1168.8463 1219.1617 1234.4271 1258.9425 1264.9803 1272.2059 1293.1076 1322.7874 1332.0444 1341.5231 1346.2839 1351.1379 1353.9777 1362.5708 1377.9602 1394.5422 1407.2176 1416.2735 1421.1966 1457.1599 1460.7200 1467.1874 1468.8195 1476.0064 1493.2438 1504.6466 1532.2199 1542.9306 1596.0509 1612.2967 1639.6540 2889.0835 2893.6271 2964.2318 2991.6465 2999.4719 3029.4415 3038.6685 3053.8897 3063.5966 3074.7006 3126.2887 3147.9308 3148.5811 3169.2777 3178.4796 3181.2552 3182.6204 3548.5569 3609.1981 3704.1608
redmass: 5.3457 4.8389 3.7702 4.7771 5.2549 4.6353 4.2401 2.6107 1.3554 4.9780 4.8713 5.2495 5.3513 5.1513 4.6889 4.7233 3.1054 2.1636 4.3168 3.0714 1.7698 2.6459 4.0342 4.3223 1.9837 5.9081 5.2360 2.8907 4.0411 4.4879 2.7732 1.2847 2.3377 3.3881 3.0008 1.2425 8.1285 4.2600 5.1880 6.1061 5.0146 5.3985 4.4756 10.4908 1.5477 2.1063 3.2574 2.4831 1.4976 3.0854 1.1234 2.3594 3.3975 6.4543 1.3596 1.4770 1.3400 1.9161 1.3540 2.6481 2.1820 1.7818 1.9055 1.8320 1.4980 2.8702 1.9200 1.4776 1.2745 2.1358 1.8463 1.5254 1.4636 1.3689 1.1612 1.1435 1.8701 1.5939 1.6097 2.2938 1.5254 1.7153 1.5351 2.4808 3.2081 1.0551 1.1203 3.7588 1.0890 1.1171 1.1001 1.1012 1.1211 2.7713 3.3966 3.0813 6.3649 1.7373 4.1862 1.7991 1.0726 1.0705 1.0644 1.0611 1.0630 1.0246 1.0959 1.1002 1.0939 1.1009 1.0852 1.0899 1.0876 1.0956 1.1068 1.0668 1.1073 1.0453 1.0874 1.1052
irintensity: 4.1254 2.8918 1.5554 4.1569 4.1219 4.1308 2.1927 2.7345 2.0341 2.0702 5.2449 1.4172 3.7505 1.1251 0.2351 5.1264 2.4949 2.5982 2.8160 4.3511 19.8279 2.5435 21.7357 3.3243 1.4481 66.5042 13.2207 4.3704 2.3070 8.4124 9.4665 358.4162 10.0005 64.8352 22.7096 3.9620 48.9484 28.2716 7.5537 1.2041 0.9305 21.3224 7.2433 53.9049 3.4780 16.6783 19.2046 13.7821 34.1868 31.8543 162.8768 2.3482 60.3150 44.8819 7.3575 19.3883 49.2820 36.0849 2.4316 1.5609 20.9570 14.8787 4.1393 21.4585 5.1149 5.2119 49.0924 11.3465 8.2129 35.1100 62.5553 64.1146 127.6336 115.0432 24.8581 13.2256 41.4023 22.8726 89.4030 480.3599 28.0010 61.4643 25.1526 276.0336 129.7551 4.5403 27.0213 56.0497 9.4718 27.7512 45.8690 39.1281 10.2760 302.2968 118.3130 154.1167 157.0842 595.9504 355.0164 622.9348 37.6384 149.1951 52.0424 38.7182 42.6938 2.4017 73.5561 38.9843 19.2402 36.4493 23.3748 9.5280 0.6568 15.4935 1.5030 208.3983 1.7699 71.8433 52.2267 37.8416
temp: 298.150 k
press: 1.00000 atm
elementType: 16 8 8 8 7 7 7 7 6 6 6 6 6 6 6 6 6 6 6 6 6 6 1 1 1 1 1 1 1 1 1 1 1 1 1 1 1 1 1 1 1 1
symmnumber: 1
zpe: 876008.6 jmol-1
zpe.correction: 0.333654 hartree
zpe.thermalcorrener: 0.356205 hartree
zpe.thermalcorrenthalpy: 0.357149 hartree
zpe.thermalcorrgfe: 0.281772 hartree
zpe.sumelectzpe: -1386.428110 hartree
zpe.sumelectthermal: -1386.405559 hartree
zpe.sumelectthermalent: -1386.404615 hartree
zpe.sumelectthermalfe: -1386.479991 hartree
dipole: 2.5841 -0.7461 4.0818
dipole: 4.8883
quadrupole: -80.8812 -138.8656 -142.9950
quadrupole: 20.5654 -7.8590 13.1619
quadrupole: 40.0327 -17.9517 -22.0811 20.5654 -7.8590 13.1619
hfenergy: -1386.7617637 hartree
pointgroup: C01 [X(C14H20N4O3S1)]
dipole: 0.949264 -0.3580875 1.6338463 debye
polarizability: 387.3717256|11.2623864|228.6959238|5.9917117|6.3424617|130.3343405 unknown
InChI: InChI=1S/C14H20N4O3S/c1-22(20,21)12-9-10(13(19)17-14(15)16)5-6-11(12)18-7-3-2-4-8-18/h5-6,9H,2-4,7-8,15-16H2,1H3
charge 0 multiplicity 1
42 atoms
S  -1.052608 2.365142 -0.034389
O  0.191039 3.168274 -0.734882
O  -2.53903 2.440346 -0.711515
O  3.702103 -1.973924 0.393543
N  -2.673958 -0.654211 0.155306
N  3.766251 0.417382 0.345895
N  5.674488 1.732161 0.315984
N  5.936796 -0.624711 0.398291
C  -3.364419 -1.857778 -0.366927
C  -3.523664 0.160749 1.058907
C  -4.681384 -1.465893 -1.075184
C  -4.83986 0.58974 0.384456
C  -5.60153 -0.643648 -0.147623
C  -1.274996 -0.630595 0.218964
C  -0.448884 0.547076 0.228876
C  -0.541403 -1.869129 0.236149
C  0.952581 0.502974 0.259451
C  0.855834 -1.922875 0.285159
C  1.631917 -0.7364 0.307255
C  -1.167949 3.144534 1.721605
C  3.119864 -0.811503 0.353553
C  5.117575 0.472775 0.354489
H  -3.586829 -2.576177 0.458324
H  -2.702221 -2.363344 -1.089272
H  -2.965682 1.047066 1.387396
H  -3.749602 -0.447969 1.967958
H  -5.187614 -2.390093 -1.414555
H  -4.434616 -0.867933 -1.972897
H  -4.588209 1.280426 -0.439454
H  -5.456886 1.142899 1.118505
H  -6.512214 -0.330316 -0.690987
H  -5.933973 -1.276536 0.702498
H  -1.105393 -2.805563 0.261624
H  1.544663 1.42164 0.187511
H  1.380846 -2.883106 0.322038
H  -1.940127 2.615537 2.29567
H  -0.16787 3.042644 2.164183
H  -1.43567 4.193483 1.531713
H  5.024706 2.512951 0.253873
H  6.677196 1.8977 0.310195
H  5.416348 -1.527567 0.417825
H  6.952884 -0.561829 0.38769
