program: Gaussian 09
title: 000123985
version: EM64L-G09RevD.01
frameworkgroup: C1[X(C15H27N5O5)]
method: RPBEPBE
basis: SDD
operation: Freq
keyword: #p
keyword: freq=noraman
keyword: PBEPBE/SDD
title: #p freq=noraman PBEPBE/SDD
converged: YES YES NO NO
title: Mulliken charges:
elementType: O O O O O N N N N N C C C C C C C C C C C C C C C H H H H H H H H H H H H H H H H H H H H H H H H H H H
charge: -0.284823 -0.262240 -0.410206 -0.288166 -0.211925 -0.380009 -0.345009 -0.119636 -0.664844 -0.656436 -0.188844 -0.179586 -0.226698 -0.380604 0.006595 0.233502 0.210546 0.213317 -0.724324 -0.737452 -0.394508 -0.371930 -0.377937 -0.443144 0.214696 0.283439 0.273707 0.266854 0.217186 0.199770 0.219030 0.343026 0.213680 0.217486 0.205167 0.265292 0.213097 0.191635 0.307677 0.249345 0.203011 0.192426 0.274740 0.182622 0.186527 0.388216 0.190160 0.194260 0.305442 0.331070 0.286999 0.367805
chargesum: 0.00000
title: Mulliken charges with hydrogens summed into heavy atoms:
elementType: O O O O O N N N N N C C C C C C C C C C C C C C C
charge: -0.284823 -0.262240 -0.021990 -0.288166 -0.211925 -0.036983 -0.037332 -0.119636 -0.028332 -0.001632 0.094595 0.094120 0.040156 0.036351 0.225625 0.233502 0.210546 0.213317 -0.087991 -0.067429 0.057847 0.095236 -0.008788 -0.058725 0.214696
polarizability: 2.18510166e+02 -4.22220162e+00 2.41447768e+02 -1.90845679e+00 -6.53005188e+00 1.93191670e+02
1716.lowfreq: -6.3592 -2.4260 -0.0003 0.0003 0.0004 4.0942 15.4512 16.1888 24.6443
frequency: 15.3113 15.6575 24.5862 35.8515 42.3734 44.3647 46.6194 56.9913 59.7199 71.4309 81.4242 82.3541 107.3321 110.6348 143.7683 153.9172 163.3836 182.4574 195.8610 209.7159 219.0309 229.1461 230.0874 244.1461 268.7834 287.9096 292.1541 313.3523 338.4321 344.5631 361.3989 372.7323 392.8204 395.1069 419.6289 421.9086 428.1810 471.1464 478.7252 514.1251 536.9964 552.2270 558.4807 580.6783 600.5240 619.3700 653.2009 669.4264 687.7680 694.8205 699.7382 708.0019 737.1854 747.6851 778.6967 814.6903 822.9340 833.0050 839.3597 851.9587 885.3876 904.4291 922.7830 938.6792 950.2821 953.6801 960.3985 975.2600 979.6223 1000.6772 1029.9044 1040.4975 1047.4496 1076.4433 1084.8855 1088.3308 1097.2137 1103.1981 1105.7422 1127.1986 1152.5153 1172.2771 1177.9751 1182.4716 1193.9325 1201.2584 1216.6918 1226.9965 1246.7539 1256.5357 1268.0532 1278.5651 1286.9956 1303.0823 1306.6026 1320.2428 1327.6286 1336.1112 1342.8089 1344.4933 1348.0661 1368.3970 1381.0521 1398.3753 1402.8965 1412.5791 1449.9630 1450.4183 1452.0316 1459.0390 1465.9895 1472.8445 1474.1842 1481.8477 1487.2812 1497.8987 1499.6225 1601.8303 1611.7444 1618.3526 1620.7303 1665.2444 1666.6065 2863.0208 2905.5019 2964.3998 2965.6483 2968.5192 2971.2827 2981.9544 2982.3532 3005.8016 3023.5714 3026.6744 3042.6409 3056.7666 3062.8940 3063.9374 3071.1702 3080.6822 3081.3511 3128.5143 3143.3496 3465.6202 3496.7599 3518.5215 3551.2023 3551.2569 3653.6666 3698.5881
redmass: 6.5570 4.8999 6.5271 9.7676 5.3902 4.6622 3.0727 5.4465 4.7816 4.1603 4.8621 5.0629 5.0038 4.0647 2.8467 4.8177 3.7914 3.0758 4.0417 1.2577 3.6068 1.8954 3.2111 1.6829 2.1535 2.6900 6.7634 2.9956 1.5492 3.7504 2.4230 4.1077 1.4613 1.8585 1.3831 2.2317 1.7943 2.9217 3.0207 2.4901 2.5852 1.9455 2.8899 2.1899 4.8665 1.4330 2.1845 1.9023 2.4506 1.7177 4.1766 4.0663 3.3571 1.5762 9.5317 2.9032 4.1223 3.0152 2.2618 2.0174 2.8203 5.0332 1.1952 2.8026 2.4147 1.5244 1.7738 2.6715 2.4024 2.1628 1.4678 2.3595 2.1979 2.5565 2.1979 1.9705 1.3152 2.3501 1.9041 2.2370 2.2778 2.1628 1.7708 1.2835 1.7160 1.3517 1.3699 1.3482 1.3989 1.5658 1.3258 1.3327 1.2045 1.6971 1.4305 1.2315 1.6367 1.3649 1.5069 1.3616 1.3563 1.4619 1.2121 1.2105 2.5801 4.4871 1.0867 1.1196 1.1259 1.0875 1.0665 1.0481 1.0863 1.0688 2.0661 1.4107 1.3096 9.3428 1.1835 2.5592 2.1911 3.2390 6.6612 1.0548 1.1012 1.0382 1.0537 1.0454 1.0605 1.0779 1.0649 1.0633 1.0943 1.0980 1.0919 1.0984 1.0988 1.0987 1.0991 1.1025 1.0994 1.0900 1.0905 1.0770 1.0488 1.0643 1.0776 1.0455 1.1007 1.1026
irintensity: 0.3462 0.8051 3.3171 0.4659 5.1669 1.5605 0.3870 1.3692 9.0918 4.4577 2.5620 3.9155 6.0726 4.5079 0.8754 0.1828 2.9532 10.5177 2.3507 0.8199 3.5406 1.6815 2.4283 2.5483 3.7170 5.1084 10.5921 3.3385 85.3761 7.1902 24.0272 8.3143 174.5990 110.1787 23.4610 7.1675 27.6127 3.6547 29.4868 2.9321 14.2205 122.9681 17.9247 14.0958 40.0784 85.9852 30.1126 67.2674 28.2666 141.1234 95.1901 24.4606 32.1542 11.1879 7.0689 3.3802 34.9449 7.2863 2.5720 14.2710 8.8013 14.0350 7.2570 12.8959 4.1660 4.9040 1.6636 6.3493 29.3053 12.3379 16.5984 20.4140 247.9176 3.7464 12.6440 6.0381 31.0931 2.3347 4.3890 1.4493 18.3929 2.2744 14.2274 0.8788 15.7667 2.8325 11.9886 4.3526 4.0328 31.5985 8.3116 37.0106 4.3477 22.5804 4.7446 9.3912 27.1258 20.1016 5.2768 40.4469 4.0059 9.1270 20.2560 22.0717 98.6194 122.4825 4.9334 22.1074 30.6996 23.3587 18.1125 7.0578 12.2063 6.1985 233.6261 127.8323 42.4289 265.8234 262.3561 45.8614 87.1914 663.3230 28.3259 103.7974 54.9957 24.9449 18.0298 39.7170 64.3689 29.7529 26.7002 61.5118 6.0262 47.0167 19.6807 8.7675 48.5321 71.1906 51.6632 14.5069 24.8768 1.9858 3.1512 60.0056 203.2950 43.4521 19.1979 14.4913 83.1783 16.8776
temp: 298.150 k
press: 1.00000 atm
elementType: 8 8 8 8 8 7 7 7 7 7 6 6 6 6 6 6 6 6 6 6 6 6 6 6 6 1 1 1 1 1 1 1 1 1 1 1 1 1 1 1 1 1 1 1 1 1 1 1 1 1 1 1
symmnumber: 1
zpe: 1123775.4 jmol-1
zpe.correction: 0.428023 hartree
zpe.thermalcorrener: 0.456908 hartree
zpe.thermalcorrenthalpy: 0.457852 hartree
zpe.thermalcorrgfe: 0.364474 hartree
zpe.sumelectzpe: -1235.694659 hartree
zpe.sumelectthermal: -1235.665775 hartree
zpe.sumelectthermalent: -1235.664831 hartree
zpe.sumelectthermalfe: -1235.758209 hartree
dipole: -1.8872 -1.9985 1.4770
dipole: 3.1204
quadrupole: -124.8030 -133.7620 -159.8412
quadrupole: 0.5854 9.0783 14.1431
quadrupole: 14.6657 5.7067 -20.3724 0.5854 9.0783 14.1431
hfenergy: -1236.1226828 hartree
pointgroup: C01 [X(C15H27N5O5)]
dipole: 0.9091365 -0.459212 -0.685377 debye
polarizability: 217.5030556|-3.8295862|241.1583067|-6.6967758|6.532644|194.4882416 unknown
InChI: InChI=1S/C15H27N5O5/c1-8(2)7-9(20-13(22)10-11(25-10)14(23)24)12(21)18-5-3-4-6-19-15(16)17/h8-11,18,20,23H,3-7,16-17H2,1-2H3
charge 0 multiplicity 1
52 atoms
O  -0.192501 2.669081 0.828125
O  -1.38611 0.06314 2.373033
O  -1.691616 4.046693 -2.180844
O  -0.417845 -1.393274 -2.157837
O  -2.182392 4.777102 -0.020256
N  -1.515607 -0.340977 0.07381
N  0.759012 -2.932663 -0.860058
N  3.41934 0.279151 0.120047
N  5.095125 1.814058 0.976663
N  2.814258 2.338254 1.093282
C  -1.530768 1.970774 0.901686
C  -1.080111 2.610035 -0.390553
C  -1.209993 -1.782327 0.124016
C  -2.473172 -2.676203 -0.027533
C  -3.517045 -2.532804 1.110638
C  -1.471313 0.476572 1.175243
C  -0.246286 -2.023058 -1.062186
C  -1.700325 3.92016 -0.789093
C  -4.799423 -3.312715 0.733715
C  -2.962606 -3.005412 2.475862
C  1.838363 -3.126378 -1.854831
C  2.928871 -2.035731 -1.73065
C  3.734078 -2.099542 -0.414338
C  4.443451 -0.761072 -0.105674
C  3.775317 1.411596 0.690376
H  -2.247653 2.526153 1.519282
H  -0.673555 2.009289 -1.211194
H  -0.718865 -1.980151 1.094003
H  -2.944745 -2.435572 -1.001375
H  -2.143884 -3.734799 -0.084549
H  -3.777968 -1.458355 1.201032
H  -1.537114 0.035101 -0.88232
H  -5.222077 -2.959943 -0.225956
H  -5.575795 -3.194988 1.511942
H  -4.586426 -4.394941 0.633119
H  -2.134379 -2.361699 2.819947
H  -3.751984 -2.962669 3.248907
H  -2.608571 -4.053962 2.415976
H  0.891106 -3.307154 0.080959
H  1.37334 -3.08066 -2.854522
H  2.260975 -4.138724 -1.710802
H  3.613903 -2.120814 -2.598504
H  2.442702 -1.045266 -1.790864
H  3.055632 -2.304934 0.437479
H  4.479195 -2.920731 -0.455605
H  -2.12767 4.90192 -2.445461
H  5.105057 -0.506251 -0.969123
H  5.110883 -0.90459 0.779478
H  5.280204 2.489258 1.714977
H  5.870804 1.256225 0.633011
H  3.046402 3.328906 1.119168
H  1.82778 2.08989 0.991952
