program: Gaussian 09
title: 000123790
version: EM64L-G09RevD.01
frameworkgroup: C1[X(C23H28O3)]
method: RPBEPBE
basis: SDD
operation: Freq
keyword: #pfreq=noraman
keyword: PBEPBE/SDD
title: #p freq=noraman PBEPBE/SDD
converged: NO YES NO NO
title: Mulliken charges:
elementType: O O O C C C C C C C C C C C C C C C C C C C C C C C H H H H H H H H H H H H H H H H H H H H H H H H H H H H
charge: -0.446463 -0.465277 -0.255822 0.372347 -0.158773 -0.177249 -0.180595 -0.633887 0.087829 -0.161438 -0.540906 -0.511470 0.085796 -0.827228 -0.440692 0.466717 0.253088 -0.771585 -0.180785 0.028508 -0.622504 -0.828163 -0.413360 0.162706 -0.084315 -0.748793 0.250997 0.265819 0.252595 0.243317 0.214493 0.216911 0.219343 0.230237 0.253296 0.232546 0.231052 0.229415 0.254246 0.235157 0.239950 0.276902 0.229511 0.262052 0.339191 0.343694 0.263647 0.231219 0.230568 0.235376 0.250581 0.252323 0.252046 0.255830
chargesum: 0.00000
title: Mulliken charges with hydrogens summed into heavy atoms:
elementType: O O O C C C C C C C C C C C C C C C C C C C C C C C
charge: -0.107272 -0.121584 -0.255822 0.372347 0.092224 0.088570 0.072000 -0.176077 0.087829 0.055473 -0.091326 -0.025628 0.085796 -0.112516 -0.205535 0.466717 0.253088 -0.025221 0.081267 0.028508 -0.358857 -0.131000 -0.162779 0.162706 -0.084315 0.011407
polarizability: 3.14313025e+02 -2.00051617e+01 2.23671537e+02 3.00246732e+01 -4.98909066e+00 2.35557591e+02
1716.lowfreq: -0.0007 -0.0005 -0.0001 4.0470 7.7319 22.1670 29.4832 30.2275 39.9865
frequency: 29.1919 30.1683 39.9637 56.0744 73.7251 91.0272 117.3786 129.4397 144.4440 149.5324 174.1198 192.7469 194.6774 200.9795 214.5352 223.0417 229.1625 243.5859 246.3794 252.3392 267.7934 274.0283 284.3856 290.7960 307.4042 315.5830 327.4213 338.0942 361.1869 374.8197 393.0158 410.6143 421.0999 428.8005 458.3090 466.8026 474.6944 485.2430 501.5632 515.7465 552.6240 572.7592 593.2703 624.4315 635.6734 660.8409 675.7416 686.4044 693.4993 748.9514 758.2372 766.3630 816.3561 822.1003 839.6415 855.8031 869.8660 873.7125 899.3458 913.6277 927.2490 929.3516 952.6186 963.6440 967.4306 977.4821 1000.2288 1003.8553 1005.5849 1015.7396 1019.0788 1028.9259 1031.4164 1035.3038 1039.2778 1047.5323 1062.2469 1069.3041 1091.8481 1111.7622 1121.5954 1127.9158 1131.4673 1136.7538 1159.8135 1181.6520 1188.6055 1213.0047 1224.1286 1225.3948 1239.9180 1245.0335 1254.0886 1266.7177 1273.8586 1280.5722 1292.2992 1298.6081 1311.2627 1314.3662 1322.2180 1332.5739 1342.6533 1358.6447 1359.6751 1367.8641 1375.8398 1384.8021 1391.4370 1401.8182 1402.1422 1402.5958 1457.9017 1460.0237 1461.9890 1465.1984 1465.5994 1469.5193 1479.3144 1482.2893 1483.2061 1489.1606 1498.2073 1543.6398 1588.9619 1631.9745 1648.2630 2264.9793 2931.6591 2938.9828 2942.9582 2954.6035 2964.4219 2974.8970 2976.3011 2995.6882 2997.1674 3001.1757 3017.0707 3031.5844 3052.6341 3057.6150 3064.7734 3065.0026 3085.6860 3087.2949 3089.6567 3096.9269 3098.6296 3106.9528 3108.1651 3120.2677 3142.8600 3147.9460 3554.5415 3555.8920
redmass: 4.3773 1.0712 3.8596 4.9102 4.2077 3.1787 4.5249 2.3412 3.5744 3.6738 3.2997 1.5672 2.4245 1.8702 1.2909 2.7417 1.9286 1.9433 2.8254 2.1010 2.8513 3.1863 3.3351 2.7776 3.4430 2.8248 2.4227 1.4554 3.4481 2.5744 4.4121 3.9287 3.6233 3.0456 3.6394 3.7975 3.6772 3.6659 3.9147 3.9730 4.7077 4.5464 5.1897 3.4750 4.0504 4.7544 4.7199 4.2067 2.8737 2.3782 2.7086 3.8694 1.7111 2.5239 1.8860 1.9315 1.8897 3.4346 2.0884 1.6433 2.1855 2.7899 2.0363 2.5326 2.0548 2.7483 1.4776 2.2867 2.9994 2.4240 2.3633 1.5487 1.5100 1.7967 1.7619 1.5427 2.3826 2.4074 1.8061 1.4467 2.2708 1.8455 2.1138 2.3720 1.9015 1.9261 1.7271 1.7016 1.7170 1.2992 1.6010 1.6780 1.5350 1.3604 1.3973 1.5391 2.2738 1.5381 1.5626 1.7626 1.6458 1.4567 1.4561 1.4030 1.3820 1.4728 1.5774 2.2562 1.6196 1.3311 1.2217 1.1899 1.0828 1.0458 1.0420 1.0679 1.0479 1.0704 1.0711 1.0694 1.0533 1.0678 1.0631 8.7443 8.1271 6.9255 7.2421 11.7652 1.0799 1.0795 1.0762 1.0724 1.0834 1.0373 1.0352 1.0342 1.0599 1.0376 1.0958 1.0616 1.0971 1.1021 1.0986 1.0983 1.0990 1.0977 1.1000 1.1024 1.0920 1.0866 1.0991 1.1004 1.0913 1.0974 1.0662 1.0658
irintensity: 2.7685 0.2055 0.9337 1.0685 0.6363 0.3317 1.5322 7.3704 0.4636 0.5058 18.7511 80.8837 10.0406 20.3661 4.3955 5.9254 2.7947 24.2703 6.2833 2.6660 1.3371 3.8480 1.2476 7.7479 15.8194 4.5231 46.1579 71.6321 5.2714 4.1227 8.8080 4.5491 4.4002 3.6795 0.9960 2.3369 6.2730 10.6051 5.1028 4.0359 4.2109 6.1444 0.8524 3.0334 6.8551 0.7981 0.1210 3.0081 11.1029 1.3209 5.0349 4.7045 26.5078 3.2114 8.7836 7.2669 7.8679 1.0272 1.9517 39.1073 22.7549 15.5231 24.5512 94.0642 25.2531 20.5942 9.6348 34.1471 2.5330 1.4682 15.6219 3.7198 1.3589 1.8808 3.4851 2.7533 30.3767 5.8299 23.8762 11.0427 13.6507 38.5514 2.2274 5.5357 13.5477 0.1297 5.6291 6.8567 6.8899 10.6397 3.1804 2.3500 3.9837 11.2029 15.7214 17.7495 34.9617 36.5571 6.2737 31.7597 9.0286 6.9270 3.5057 11.3264 5.4116 11.0956 4.3663 15.2418 18.7932 15.3455 1.5631 29.6075 1.5072 14.4983 13.8381 8.4963 15.0913 12.8576 17.9639 5.9365 7.2538 0.9019 12.3993 184.2685 68.3082 5.5325 136.8137 10.1975 21.4797 5.1461 8.7843 58.4684 33.6463 29.3646 31.4866 19.9378 31.7884 26.4536 21.4915 28.6876 16.6239 16.0709 11.0588 10.3920 10.2886 24.0143 24.9120 21.6312 30.3241 5.2318 11.7721 3.1513 14.6178 11.5345 9.0652 5.2621
temp: 298.150 k
press: 1.00000 atm
elementType: 8 8 8 6 6 6 6 6 6 6 6 6 6 6 6 6 6 6 6 6 6 6 6 6 6 6 1 1 1 1 1 1 1 1 1 1 1 1 1 1 1 1 1 1 1 1 1 1 1 1 1 1 1 1
symmnumber: 1
zpe: 1183405.5 jmol-1
zpe.correction: 0.450735 hartree
zpe.thermalcorrener: 0.476504 hartree
zpe.thermalcorrenthalpy: 0.477448 hartree
zpe.thermalcorrgfe: 0.396835 hartree
zpe.sumelectzpe: -1116.885539 hartree
zpe.sumelectthermal: -1116.859770 hartree
zpe.sumelectthermalent: -1116.858826 hartree
zpe.sumelectthermalfe: -1116.939439 hartree
dipole: -6.1489 0.3826 0.2794
dipole: 6.1671
quadrupole: -198.7083 -145.1235 -145.5865
quadrupole: 10.2035 -24.6522 7.3216
quadrupole: -35.5688 18.0159 17.5529 10.2035 -24.6522 7.3216
hfenergy: -1117.3362742 hartree
pointgroup: C01 [X(C23H28O3)]
dipole: 2.418126 0.1243146 0.1558833 debye
polarizability: 314.4741855|-29.2655432|235.0909885|20.8324574|-5.1850677|223.9769786 unknown
InChI: InChI=1S/C23H28O3/c1-5-8-23(26)10-7-17-16-11-14(2)18-12-15(24)6-9-21(18,3)20(16)19(25)13-22(17,23)4/h6,9,11-12,16-17,19-20,25-26H,7,10,13H2,1-4H3
charge 0 multiplicity 1
54 atoms
O  4.868755 0.033424 0.992919
O  -0.087006 0.386975 2.913775
O  -5.680685 1.689077 -0.981566
C  2.316009 -0.212776 0.832433
C  1.473662 -0.90184 -0.285186
C  0.026636 -1.193236 0.179639
C  -0.646817 0.168086 0.521972
C  1.64152 1.123791 1.218063
C  3.708738 -0.099292 0.074529
C  0.133001 0.990296 1.57654
C  2.381013 -2.059621 -0.782324
C  3.834434 -1.501295 -0.622433
C  -2.193725 -0.024477 0.769901
C  2.515712 -1.107142 2.084279
C  -0.783052 -1.937973 -0.859904
C  -2.782523 -0.514994 -0.559505
C  -2.065498 -1.62192 -1.233042
C  -2.500474 -1.116396 1.863217
C  -2.848715 1.246712 1.269664
C  3.73551 1.007664 -0.905484
C  -3.934867 0.033104 -1.077077
C  -2.758678 -2.380269 -2.352404
C  -3.967544 1.795247 0.716778
C  -4.608549 1.202239 -0.481964
C  3.807134 1.93412 -1.719844
C  3.900053 3.023334 -2.703719
H  1.395261 -0.171741 -1.121094
H  0.083755 -1.816838 1.097977
H  -0.574649 0.784807 -0.402021
H  1.71692 1.826493 0.36416
H  2.169073 1.604909 2.070262
H  -0.289365 2.018925 1.594157
H  2.158895 -2.331659 -1.828637
H  2.235136 -2.968109 -0.167915
H  4.453265 -2.137934 0.032952
H  4.358211 -1.411656 -1.587838
H  2.963392 -2.083559 1.833371
H  3.210006 -0.61236 2.7859
H  1.557858 -1.276568 2.601558
H  -0.282108 -2.778981 -1.359553
H  -2.114275 -2.102011 1.55319
H  -2.031209 -0.832717 2.817562
H  -3.592959 -1.204052 1.996573
H  -2.424821 1.666697 2.191651
H  5.048202 0.998319 1.133332
H  0.537542 0.81248 3.554684
H  -4.388155 -0.348551 -1.999179
H  -2.132634 -3.217249 -2.705483
H  -2.963492 -1.724972 -3.220598
H  -3.730978 -2.790534 -2.021218
H  -4.452798 2.681571 1.142286
H  2.993421 3.655934 -2.693737
H  4.767607 3.675552 -2.492771
H  4.021753 2.624765 -3.727727
