program: Gaussian 09
title: 000124137
version: EM64L-G09RevD.01
frameworkgroup: C1[X(C19H20Cl2N2O6)]
method: RPBEPBE
basis: SDD
operation: Freq
keyword: #p
keyword: freq=noraman
keyword: PBEPBE/SDD
title: #p freq=noraman PBEPBE/SDD
converged: YES YES NO NO
title: Mulliken charges:
elementType: Cl Cl O O O O O O N N C C C C C C C C C C C C C C C C C C C H H H H H H H H H H H H H H H H H H H H
charge: -0.077789 -0.088786 -0.242828 -0.466603 -0.450495 -0.462085 -0.377029 -0.250480 -0.406734 -0.682066 -0.151745 -0.172512 -0.183161 -0.050370 -0.079092 0.148350 0.538711 -0.363003 -0.321192 0.545767 -0.381573 -0.496347 -0.718615 0.543915 -0.485374 -0.376096 -0.306373 -0.381317 0.568142 0.230265 0.237411 0.252790 0.234039 0.244856 0.334283 0.371808 0.371961 0.378508 0.278970 0.270282 0.232426 0.225789 0.228645 0.390959 0.254692 0.243595 0.220228 0.317192 0.308081
chargesum: 0.00000
title: Mulliken charges with hydrogens summed into heavy atoms:
elementType: Cl Cl O O O O O O N N C C C C C C C C C C C C C C C C C C C
charge: -0.077789 -0.088786 -0.242828 -0.094795 -0.078533 -0.083577 0.013929 -0.250480 -0.072451 -0.056793 0.078520 0.064900 0.069629 0.183669 0.165764 0.148350 0.538711 -0.363003 -0.042222 0.545767 -0.111291 -0.263921 -0.264180 0.543915 -0.230682 -0.132501 -0.306373 -0.161090 0.568142
polarizability: 4.13051170e+02 -1.83163535e+01 2.27234839e+02 -1.31067055e+00 -5.62797920e+00 1.94225176e+02
1716.lowfreq: -10.7501 -3.6111 -0.0020 -0.0008 0.0011 0.8734 5.6216 12.8197 20.6276
frequency: -4.5314 12.8030 20.5810 28.7134 35.4223 40.1994 52.9890 69.5039 105.0289 113.7720 120.7203 129.4180 133.4344 166.3837 170.0620 172.8260 194.7255 209.7744 223.4517 240.7701 257.7953 271.7937 275.6428 299.1639 325.1392 330.7002 349.1859 366.1947 369.2438 380.8510 383.0112 401.4061 409.5079 427.7766 433.9279 435.0306 451.3254 451.6629 458.5165 471.0851 482.5610 505.3759 520.3014 526.5041 550.6898 555.1624 562.1204 570.9904 584.0415 620.5659 623.0425 651.2036 670.4834 679.0365 709.3336 712.4886 721.7478 774.9150 805.1409 813.7230 824.8204 846.2555 861.1320 869.3301 878.5880 890.8639 907.1593 938.7777 948.5271 961.1271 963.7503 980.6242 995.9472 1015.8438 1026.7516 1032.7462 1039.7899 1048.2469 1060.5928 1066.3486 1078.4419 1112.2151 1142.2873 1158.1016 1172.4446 1184.7609 1195.4277 1199.2008 1214.5675 1221.4542 1225.7859 1232.6562 1252.8477 1269.2606 1281.3393 1284.5598 1295.3612 1310.5932 1315.5906 1326.3406 1329.0498 1332.0487 1343.1458 1365.6722 1368.9269 1380.3431 1381.0001 1393.7330 1407.3736 1415.4895 1420.4062 1459.9412 1477.1121 1514.9745 1523.8363 1562.1956 1573.1888 1616.9536 1626.1554 1630.5387 1645.1949 2915.7380 2917.7468 2957.8309 2964.3254 2973.6543 3006.0310 3008.3895 3120.4324 3124.2352 3143.2662 3147.5007 3154.7536 3164.3687 3505.0903 3509.9036 3531.5481 3537.6424 3557.0569 3560.3610 3704.3953
redmass: 7.8253 9.3306 7.5809 7.5694 7.2404 7.6394 9.0789 6.8727 7.4800 6.5432 5.4843 7.9744 10.4274 6.1856 5.6519 6.2790 5.0419 5.5370 4.0872 5.5355 4.5011 4.8208 5.2987 6.2274 3.3224 4.9566 3.6753 2.7155 1.7493 8.2995 5.5676 4.2949 4.5867 2.4020 1.8184 1.4499 1.2533 1.2750 3.3707 2.6080 2.0758 3.5243 4.6945 6.5236 2.8892 1.1800 3.1359 3.6510 3.7280 4.3796 1.5894 4.2830 6.8445 6.2134 4.2016 3.7373 4.0605 3.3890 3.9983 1.4807 1.6373 6.1907 3.8455 1.4077 4.1505 1.8010 7.0921 1.5092 1.3765 5.4886 1.7492 8.1900 4.4293 2.1598 3.0797 4.9243 1.8050 2.3035 2.7475 3.2490 2.5982 2.3271 1.5259 1.2200 1.3532 1.1875 1.7086 2.1378 1.7346 1.1518 1.2305 1.2859 1.2829 1.4853 1.5159 1.3191 2.1127 1.2771 1.2885 1.4372 1.8971 2.2488 1.3533 1.9484 2.9658 3.9089 1.8433 1.4415 1.9558 4.0103 4.2285 1.1750 1.7888 3.4029 3.1004 6.5954 4.4165 1.4779 8.7898 6.8304 3.2099 1.0831 1.0802 1.0816 1.0597 1.0848 1.0854 1.1002 1.0871 1.0895 1.0941 1.0945 1.0922 1.0945 1.0643 1.0651 1.0765 1.0656 1.0452 1.0656 1.1037
irintensity: 0.1073 0.2414 0.1711 0.1547 0.1730 0.2628 1.3787 0.9500 3.6223 1.1801 0.6429 0.9864 1.9990 0.1673 2.8969 1.1500 14.9066 5.7955 2.5194 8.0164 14.3710 15.5009 0.9045 3.8460 8.5218 8.0902 21.0252 56.2133 111.5112 10.1268 5.2557 4.6302 1.5817 37.1585 89.8676 38.0545 56.5571 131.2130 8.6058 73.4047 68.6153 9.4210 18.7682 11.4613 24.5971 181.4841 10.8805 46.3992 54.3947 13.0839 92.5905 53.1017 12.7471 15.6759 40.1001 2.3661 15.4300 10.9691 24.7127 49.8043 36.3807 235.8569 5.4147 16.7868 23.4466 21.0313 86.5616 19.6405 0.5925 69.2246 6.8883 134.8292 49.5550 1.5967 20.1251 51.7590 30.8915 27.7813 138.3893 58.6003 63.1821 65.2980 1.5272 19.0942 13.1156 5.2519 3.6514 116.3406 6.2899 8.2023 42.2033 20.6044 8.9407 13.7882 4.6261 24.6067 75.1053 44.2672 42.3407 3.4814 114.2340 13.7162 2.4649 70.8264 73.6914 33.1147 5.6938 16.2408 21.2386 3.4338 0.4173 19.4859 4.2662 272.9682 380.3323 3.5929 30.0272 49.8354 312.4381 94.5964 224.7400 38.4720 17.8061 7.1133 35.0482 51.0965 50.2167 13.6401 16.6651 14.7862 14.1113 3.2506 1.8617 3.3385 65.4871 19.1912 64.1992 16.9230 95.1114 28.6699 32.6490
temp: 298.150 k
press: 1.00000 atm
elementType: 17 17 8 8 8 8 8 8 7 7 6 6 6 6 6 6 6 6 6 6 6 6 6 6 6 6 6 6 6 1 1 1 1 1 1 1 1 1 1 1 1 1 1 1 1 1 1 1 1
symmnumber: 1
zpe: 964973.5 jmol-1
zpe.correction: 0.367539 hartree
zpe.thermalcorrener: 0.394971 hartree
zpe.thermalcorrenthalpy: 0.395916 hartree
zpe.thermalcorrgfe: 0.307695 hartree
zpe.sumelectzpe: -2214.847519 hartree
zpe.sumelectthermal: -2214.820087 hartree
zpe.sumelectthermalent: -2214.819143 hartree
zpe.sumelectthermalfe: -2214.907363 hartree
dipole: -1.3339 3.7268 1.0166
dipole: 4.0868
quadrupole: -170.6730 -178.1933 -173.5582
quadrupole: 1.5922 18.2990 0.6494
quadrupole: 3.4685 -4.0518 0.5833 1.5922 18.2990 0.6494
hfenergy: -2215.2150584 hartree
pointgroup: C01 [X(C19H20Cl2N2O6)]
dipole: 0.4492601 1.4851113 0.4217182 debye
polarizability: 410.8251981|25.6366891|215.4365951|9.8534862|17.9078284|208.249392 unknown
InChI: InChI=1S/C19H20Cl2N2O6/c20-10-6-8(1-3-12(10)22)5-9-2-4-13(11(21)7-9)23-18-16(26)14(24)15(25)17(29-18)19(27)28/h1-4,6-7,14-18,23-27H,5,22H2
charge 0 multiplicity 1
49 atoms
Cl -0.494994 -2.135679 -2.288829
Cl -8.41712 -1.30769 0.289702
O  3.260997 0.85428 0.081943
O  6.587389 -1.404279 -1.102287
O  4.017275 -2.627006 -1.094359
O  6.967488 0.747227 0.79604
O  3.432096 3.07609 1.767806
O  5.609755 3.271069 0.996494
N  1.792827 -0.857865 -0.738183
N  -7.905915 1.166953 -1.424014
C  5.542151 -0.894673 -0.211452
C  4.210637 -1.190006 -0.918397
C  5.709473 0.604596 0.0608
C  3.033674 -0.644056 -0.086529
C  4.479624 1.087762 0.868621
C  4.58238 2.572987 1.190992
C  0.550846 -0.717272 -0.103666
C  -0.632783 -1.25538 -0.680122
C  0.397926 -0.022079 1.12835
C  -2.027831 -0.479614 1.166665
C  -1.892276 -1.146689 -0.078675
C  -0.86399 0.07958 1.747757
C  -3.383059 -0.396635 1.867353
C  -4.557012 -0.000085 0.974742
C  -5.770907 -0.72959 1.011546
C  -4.488834 1.125772 0.112468
C  -6.858658 -0.332101 0.218943
C  -5.584187 1.515839 -0.677425
C  -6.815491 0.793341 -0.64829
H  5.57671 -1.43684 0.759467
H  4.22119 -0.671849 -1.902339
H  5.742584 1.162086 -0.897959
H  3.040656 -1.073401 0.942543
H  4.438759 0.531775 1.83585
H  1.805403 -1.325605 -1.647248
H  7.463855 -1.15565 -0.71079
H  4.854207 -2.986829 -1.489988
H  7.152203 1.72154 0.872818
H  1.266866 0.483011 1.559379
H  -2.77056 -1.573864 -0.572651
H  -0.94615 0.624579 2.696034
H  -3.292288 0.324576 2.704818
H  -3.613367 -1.374876 2.335799
H  3.541776 4.049217 1.952371
H  -5.870069 -1.608724 1.657436
H  -3.556512 1.699335 0.054328
H  -5.503155 2.38976 -1.33513
H  -8.766491 0.626555 -1.384816
H  -7.849501 1.968004 -2.044615
