program: Gaussian 09
title: 000123885
version: EM64L-G09RevD.01
frameworkgroup: C1[X(C18H22Cl2NO3P)]
method: RPBEPBE
basis: SDD
operation: Freq
keyword: #p
keyword: freq=noraman
keyword: PBEPBE/SDD
title: #p freq=noraman PBEPBE/SDD
converged: YES YES NO NO
title: Mulliken charges:
elementType: Cl Cl P O O O N C C C C C C C C C C C C C C C C C C H H H H H H H H H H H H H H H H H H H H H H
charge: -0.039290 -0.017498 1.136435 -0.429614 -0.687029 -0.635285 -0.351692 -0.091398 -0.776063 -0.392548 -0.877239 -0.207073 0.461627 0.524452 -0.728583 -0.334527 -0.456524 -0.350309 -0.399815 -0.057108 -0.190963 -0.221753 -0.225350 -0.115498 -0.237492 0.243821 0.272735 0.291165 0.187193 0.287671 0.260935 0.285246 0.205812 0.271974 0.237545 0.214343 0.231625 0.330880 0.392168 0.295180 0.241121 0.261710 0.241063 0.254839 0.233280 0.228761 0.231070
chargesum: 0.00000
title: Mulliken charges with hydrogens summed into heavy atoms:
elementType: Cl Cl P O O O N C C C C C C C C C C C C C C C C C C
charge: -0.039290 -0.017498 1.136435 -0.098734 -0.294861 -0.635285 -0.079718 0.152423 -0.212163 0.082316 -0.331058 -0.001261 0.461627 0.524452 -0.045071 -0.039347 -0.215403 -0.088599 -0.158751 -0.057108 0.063876 0.011527 0.003412 -0.115498 -0.006422
polarizability: 2.77807203e+02 -3.84906456e+01 2.99818426e+02 2.39458811e+01 1.49597866e+01 1.72131348e+02
1716.lowfreq: -14.8892 -7.8608 -6.8175 -0.0019 -0.0016 -0.0014 0.7078 11.1860 15.0144
frequency: -14.0276 10.8781 14.7198 17.2108 18.6274 34.9054 52.8889 55.6334 84.8394 86.9727 114.8335 133.1617 151.9384 171.0326 182.6244 185.2517 191.3658 210.7701 217.5231 226.6387 234.0906 247.0945 267.9339 280.0548 317.6177 333.3745 336.6733 347.8516 360.9172 391.0320 402.0735 403.7978 418.2907 428.6893 447.2552 470.3463 476.2918 482.3376 552.2020 568.3686 594.2560 614.6317 616.7062 633.6359 662.1769 672.6198 687.6338 702.2846 709.4658 734.9747 772.8913 804.1145 813.1432 822.9777 826.0370 852.3928 859.4873 865.9280 922.4406 926.3031 930.6366 957.1162 974.2461 979.7994 989.1732 995.3448 999.0816 1001.5233 1007.8552 1023.4179 1027.0120 1034.6039 1070.7942 1077.7439 1097.0724 1104.7667 1128.2254 1141.3383 1146.2803 1159.4887 1165.3099 1173.5805 1174.2944 1192.4857 1210.6101 1212.2089 1231.3759 1238.3293 1241.1255 1282.3301 1296.6358 1311.1435 1322.2845 1331.0552 1372.3675 1378.6526 1383.2624 1384.2261 1389.0594 1392.0558 1422.1034 1425.1102 1441.4638 1447.5999 1455.7157 1472.1415 1477.6525 1483.3976 1484.6886 1573.2612 1591.9410 1596.9858 1611.5485 2831.7839 2851.3980 2980.2159 3013.3428 3013.5717 3017.8573 3044.4941 3075.9886 3091.1169 3094.2714 3098.5824 3122.4354 3130.1177 3131.5585 3142.5860 3152.5385 3152.7531 3167.1683 3168.0350 3473.5297 3529.4184 3586.9930
redmass: 4.9760 6.8177 7.0253 4.7948 6.7352 7.9839 5.5594 7.7808 5.6610 4.2268 4.4622 4.3335 4.8119 4.8711 11.2627 5.4600 4.1968 3.9474 4.4359 1.7765 1.6037 3.6080 2.3518 2.1265 7.1474 2.3508 3.6032 2.8802 1.2904 3.4671 2.8751 4.8432 8.0008 4.1284 3.0665 3.5131 4.3049 2.7921 3.6641 5.2002 4.6276 4.8352 5.5353 2.2051 6.1635 1.9482 6.1314 1.8288 3.3252 4.3246 1.8523 4.3899 4.0175 1.3827 2.3647 1.3324 2.1273 1.6451 1.5283 1.4203 1.7324 1.3560 2.3951 1.4046 6.1250 2.9456 1.3483 2.0089 2.4806 1.5531 2.1480 2.3242 2.1059 1.8122 1.8973 1.8431 2.6626 1.6971 1.2486 1.4053 2.1914 1.2927 1.0527 1.1305 1.8019 1.9581 1.5339 1.3277 1.4138 1.3393 1.3820 1.3483 1.8079 1.2644 1.5275 5.1795 6.9808 1.2444 1.4943 1.5966 1.1074 1.0932 2.1724 1.4938 1.7355 1.0701 1.1563 2.2647 1.0919 7.7383 6.0159 6.9059 6.0160 1.0712 1.0810 1.0364 1.0604 1.0877 1.0579 1.0848 1.0988 1.1054 1.1027 1.1000 1.0861 1.0896 1.0876 1.0923 1.0966 1.0912 1.1017 1.0953 1.0749 1.0657 1.0658
irintensity: 1.2669 0.6776 0.2471 0.0968 0.9295 0.6382 0.9150 0.4312 4.9076 0.3488 1.7544 6.4543 1.0991 1.3268 0.8450 2.2488 5.2033 2.1637 2.6970 14.9941 24.1789 11.9047 8.7447 38.9445 4.5721 18.9117 8.1798 79.6816 105.0618 53.2649 0.7720 25.4077 4.7122 23.1331 6.7380 27.9733 23.0851 4.2846 11.5203 8.7170 9.2639 21.4071 10.5301 31.9709 12.4069 63.1442 94.8355 44.1130 8.4220 28.7098 61.6244 13.5587 32.7910 33.8434 7.0145 3.1109 44.5578 5.4169 16.0363 2.4687 35.9284 2.0736 22.1581 0.1628 1.4568 33.2521 2.2910 29.7304 35.9291 25.2991 9.2915 101.0412 17.5883 25.0348 22.2963 15.3160 44.5961 1.8899 16.5631 19.6109 22.1932 68.0843 0.1176 0.6516 52.0391 2.2111 10.6264 11.4445 0.2900 2.8620 41.2213 11.2511 14.4394 0.3233 8.6859 7.7873 0.9654 16.2252 31.7295 55.8361 8.4502 16.0352 8.8610 36.3299 24.4377 10.7072 14.2370 22.1405 4.9738 10.5234 0.9371 2.2308 5.0974 83.6430 94.6316 36.2890 4.0494 1.2806 10.5644 17.1965 37.9682 1.1688 5.3618 20.5533 3.5638 9.3078 1.5487 18.9081 22.2334 3.3781 19.7756 4.4836 4.0115 8.2149 32.3000
temp: 298.150 k
press: 1.00000 atm
elementType: 17 17 15 8 8 8 7 6 6 6 6 6 6 6 6 6 6 6 6 6 6 6 6 6 6 1 1 1 1 1 1 1 1 1 1 1 1 1 1 1 1 1 1 1 1 1 1
symmnumber: 1
zpe: 956435.3 jmol-1
zpe.correction: 0.364287 hartree
zpe.thermalcorrener: 0.390345 hartree
zpe.thermalcorrenthalpy: 0.391289 hartree
zpe.thermalcorrgfe: 0.303666 hartree
zpe.sumelectzpe: -2239.002271 hartree
zpe.sumelectthermal: -2238.976214 hartree
zpe.sumelectthermalent: -2238.975270 hartree
zpe.sumelectthermalfe: -2239.062892 hartree
dipole: 0.3424 -3.6985 0.4076
dipole: 3.7366
quadrupole: -143.2706 -166.0421 -176.7815
quadrupole: -11.7049 6.5646 -1.4725
quadrupole: 18.7608 -4.0107 -14.7501 -11.7049 6.5646 -1.4725
hfenergy: -2239.3665584 hartree
pointgroup: C01 [X(C18H22Cl2N1O3P1)]
dipole: 0.4174274 -1.4053738 0.1087997 debye
polarizability: 292.7264588|-41.1011439|282.1652426|21.3167813|23.2734307|174.8652757 unknown
InChI: InChI=1S/C18H22Cl2NO3P/c1-13(15-7-8-17(19)18(20)9-15)21-10-16(22)12-25(23,24)11-14-5-3-2-4-6-14/h2-9,13,16,21-23H,10-12H2,1H3
charge 0 multiplicity 1
47 atoms
Cl 0.382013 2.805313 -1.527217
Cl 1.452931 4.776544 0.893014
P  -1.43209 -1.760414 0.654174
O  1.479921 -4.227882 -1.040976
O  -2.790017 -2.599162 1.376273
O  -0.725346 -0.656303 1.581439
N  3.015128 -1.736639 -0.572894
C  0.890473 -2.972442 -0.513896
C  -0.404796 -3.285369 0.260977
C  1.928826 -2.188961 0.308459
C  -2.138246 -1.043058 -0.963355
C  3.990923 -0.793426 0.00293
C  -3.347542 -0.174603 -0.687651
C  3.346826 0.580472 0.240544
C  5.196098 -0.665704 -0.961826
C  2.314707 1.031697 -0.613662
C  3.788308 1.426229 1.285713
C  -3.183043 1.18119 -0.299784
C  -4.657848 -0.713769 -0.779066
C  1.735133 2.296872 -0.420851
C  3.216106 2.70277 1.471496
C  -4.310692 1.982749 -0.015635
C  -5.784847 0.090929 -0.496471
C  2.183922 3.140743 0.615736
C  -5.614104 1.441881 -0.113623
H  0.674432 -2.405075 -1.436908
H  -0.191812 -3.763433 1.235992
H  -1.04545 -3.96451 -0.327434
H  2.279156 -2.837849 1.154481
H  1.443271 -1.309168 0.772425
H  -2.382702 -1.900879 -1.613194
H  -1.314646 -0.465256 -1.418211
H  4.381807 -1.147795 0.990552
H  3.448084 -2.511875 -1.088824
H  4.853104 -0.320073 -1.953235
H  5.70486 -1.640843 -1.084533
H  5.931735 0.060314 -0.576229
H  1.698376 -4.815426 -0.270642
H  -3.439735 -1.993553 1.816858
H  1.968277 0.366634 -1.4112
H  4.576145 1.088236 1.969309
H  -2.175178 1.602382 -0.215295
H  -4.795084 -1.759242 -1.080246
H  3.551769 3.357063 2.281434
H  -4.170739 3.027842 0.281503
H  -6.791817 -0.333581 -0.577963
H  -6.487498 2.066732 0.103814
