program: Gaussian 09
title: 000014720
version: EM64L-G09RevD.01
frameworkgroup: C1[X(C25H24)]
method: RPBEPBE
basis: SDD
operation: Freq
keyword: #p
keyword: freq=noraman
keyword: PBEPBE/SDD
title: #p freq=noraman PBEPBE/SDD
converged: YES YES NO NO
title: Mulliken charges:
elementType: C C C C C C C C C C C C C C C C C C C C C C C C C H H H H H H H H H H H H H H H H H H H H H H H H
charge: 0.351078 -0.538845 -0.478346 0.046635 -0.573601 0.320940 -0.765705 -0.766374 0.229257 0.217665 -0.452313 -0.407782 0.240800 -0.490974 0.252882 -0.450280 0.193309 -0.433474 0.245199 -0.479803 -0.376850 0.320702 -0.467641 -0.263933 -0.837883 0.222292 0.212151 0.207323 0.210530 0.232022 0.222985 0.217896 0.211019 0.212923 0.212252 0.238919 0.209498 0.231094 0.220431 0.242697 0.217722 0.218719 0.241753 0.223007 0.232458 0.224491 0.238551 0.232339 0.232265
chargesum: 0.00000
title: Mulliken charges with hydrogens summed into heavy atoms:
elementType: C C C C C C C C C C C C C C C C C C C C C C C C C
charge: 0.351078 -0.104401 -0.060493 0.046635 -0.118595 0.320940 -0.123867 -0.105705 0.229257 0.217665 -0.221219 -0.187351 0.240800 -0.248277 0.252882 -0.232558 0.193309 -0.214756 0.245199 -0.238050 -0.153842 0.320702 -0.235183 -0.039442 -0.134728
polarizability: 4.89190501e+02 -2.62176987e+01 2.81228509e+02 5.82610146e+00 3.67994379e+00 1.36555713e+02
1716.lowfreq: -7.8983 -2.4031 -0.0010 -0.0005 0.0004 13.1426 31.7221 42.7677 70.3840
frequency: 31.6874 42.5164 70.3830 90.7770 103.0778 108.9162 177.0112 189.7369 191.2239 193.3457 209.8407 223.2897 242.8018 252.6416 265.1964 270.7210 281.6640 306.8021 326.9531 343.8022 392.7383 406.1104 419.9787 436.3081 458.5010 465.5332 482.0461 489.9977 500.0576 518.3295 524.2233 541.9606 545.4497 569.4836 596.0135 608.8508 609.7986 676.6750 680.7426 693.4376 730.9191 747.2932 776.6139 793.4523 809.6260 819.3654 827.1400 833.6828 842.4796 856.0851 862.7582 878.8393 896.3077 905.6870 913.3397 928.7525 939.2386 951.1590 960.5756 970.2054 975.5948 980.2131 985.0253 1002.8601 1011.0201 1032.4178 1045.7311 1053.5898 1090.0958 1125.9064 1133.9382 1149.5704 1160.3036 1179.7647 1187.0500 1197.2374 1201.1131 1204.7650 1233.4291 1242.2142 1251.3030 1255.1205 1260.0673 1278.4053 1284.1665 1292.8445 1320.3251 1332.2983 1344.9447 1353.2585 1368.9312 1375.8380 1393.0100 1395.5809 1396.8937 1406.2055 1407.4234 1422.8042 1443.6522 1447.8088 1454.4187 1459.2599 1464.4056 1469.9119 1473.5351 1473.5890 1480.3616 1483.9462 1489.2118 1493.4781 1530.4737 1532.5942 1580.7177 1599.7583 1610.1049 1619.2366 1621.8855 2946.2537 2961.5550 2962.2573 2967.4208 2972.8317 2973.0954 3004.2594 3011.8410 3030.3018 3047.8500 3056.9318 3060.9241 3063.9698 3075.6820 3085.9194 3113.0083 3122.1146 3139.8799 3141.1253 3146.6854 3158.1383 3163.8567 3170.0342 3172.6738
redmass: 4.1672 3.8237 3.4176 3.3751 3.7375 3.7969 2.2967 3.8393 1.6158 1.5130 2.3721 1.2580 2.7963 1.8528 3.3749 2.2512 2.3341 2.8104 2.8296 3.1022 2.0721 2.6251 3.4376 3.3553 3.3202 4.6663 3.3472 4.1761 4.8486 4.3582 4.2687 3.1525 4.7284 3.9184 3.2458 4.1678 4.4930 4.4619 5.3533 2.9632 2.5650 1.8691 1.5315 3.9682 1.6728 1.7106 3.4897 4.0224 2.3283 4.0803 3.2544 2.5012 2.3035 1.4930 2.3303 1.8056 1.4578 2.0934 1.4255 1.4077 1.3469 1.3549 1.8537 1.6202 1.7776 1.9006 1.5631 2.2213 1.9320 3.0531 1.6283 1.8260 1.4228 1.5407 1.3292 2.2716 1.3731 1.7404 1.8070 1.8416 1.8079 1.8221 1.6778 1.9353 2.0030 2.2356 1.9309 1.6397 3.3158 1.6792 2.7640 1.2189 1.4002 1.6783 1.8347 3.3725 3.6030 3.8440 1.7780 1.8563 1.1283 1.1245 1.6184 1.0585 1.1327 1.0545 1.0697 1.1345 2.5075 1.0934 3.8452 4.5908 7.9249 6.6412 6.0696 6.5295 6.4029 1.0624 1.0465 1.0517 1.0534 1.0380 1.0437 1.0960 1.0948 1.1027 1.0973 1.0995 1.0994 1.0986 1.0987 1.0979 1.0884 1.0868 1.0900 1.0864 1.0879 1.0948 1.0966 1.0937 1.0942
irintensity: 0.3100 0.0469 0.2631 0.0018 0.2492 0.0679 0.3293 0.2081 0.3511 1.0275 0.0294 0.0870 0.1174 0.3946 14.2786 0.1783 0.4918 0.4851 0.1221 1.8925 0.0916 0.5150 0.0030 0.0198 0.0383 0.5471 0.3981 0.5212 6.2473 11.0866 13.1127 0.2394 0.9229 0.0990 0.7752 0.5736 0.5544 1.5376 0.1038 1.0295 0.4195 0.2659 24.7613 5.5417 64.0480 35.7694 27.5394 1.1960 27.3927 5.0157 1.3019 4.9873 0.6369 0.2898 0.0174 0.9186 2.9893 3.7167 0.1165 0.0614 0.1285 0.4609 4.9907 0.3545 2.4123 2.1263 6.5428 0.5063 8.8789 5.3976 2.4300 1.0058 2.9019 2.4548 0.4721 1.4584 0.4362 1.2402 12.9753 10.4511 2.8881 10.7227 5.8516 4.9046 6.6256 3.8025 6.9478 0.4182 0.1214 8.9945 2.6611 20.4521 27.0499 6.2187 12.7478 4.2879 0.6762 0.0477 16.4979 21.8465 6.2718 5.5718 11.7048 14.6826 12.1572 8.4324 8.9392 19.2223 4.8609 5.4936 0.5845 3.5064 0.3995 18.2332 6.6443 2.4847 4.7302 19.7328 9.5124 48.3030 55.7723 56.3850 32.6591 19.2930 33.3885 51.1777 19.9565 14.2883 35.4324 69.5606 53.9715 24.9875 18.7849 10.0737 25.3771 3.8700 7.2099 1.3168 8.6762 49.2042 27.6598
temp: 298.150 k
press: 1.00000 atm
elementType: 6 6 6 6 6 6 6 6 6 6 6 6 6 6 6 6 6 6 6 6 6 6 6 6 6 1 1 1 1 1 1 1 1 1 1 1 1 1 1 1 1 1 1 1 1 1 1 1 1
symmnumber: 1
zpe: 1078974.0 jmol-1
zpe.correction: 0.410959 hartree
zpe.thermalcorrener: 0.431674 hartree
zpe.thermalcorrenthalpy: 0.432618 hartree
zpe.thermalcorrgfe: 0.362981 hartree
zpe.sumelectzpe: -965.376213 hartree
zpe.sumelectthermal: -965.355499 hartree
zpe.sumelectthermalent: -965.354555 hartree
zpe.sumelectthermalfe: -965.424191 hartree
dipole: -0.8013 0.2169 -0.0324
dipole: 0.8308
quadrupole: -126.0481 -133.3439 -155.7240
quadrupole: 1.4491 0.8960 0.7539
quadrupole: 12.3239 5.0281 -17.3520 1.4491 0.8960 0.7539
hfenergy: -965.7871725 hartree
pointgroup: C01[X(C25H24)]
dipole: -0.317059 -0.0786056 0.0115648 debye
polarizability: 490.2423253|21.7338834|280.0886688|-5.1224618|5.38879|136.6437285 unknown
InChI: InChI=1S/C25H24/c1-16-5-4-6-19-18(16)9-10-22-20-8-7-17-13-14-25(2,3)15-24(17)23(20)12-11-21(19)22/h4-12H,13-15H2,1-3H3
charge 0 multiplicity 1
49 atoms
C  -5.10994 0.994676 -0.125046
C  -3.608852 1.251451 0.196541
C  -5.558974 -0.291202 0.621141
C  -2.708051 0.018561 0.126202
C  -4.759869 -1.527128 0.165775
C  -3.257226 -1.278648 0.116127
C  -5.948011 2.199213 0.369511
C  -5.304804 0.837737 -1.657662
C  -1.271155 0.182414 0.10188
C  -0.394403 -0.963072 0.030641
C  -2.381723 -2.40625 0.052115
C  -0.99619 -2.26082 0.002469
C  1.055662 -0.774018 -0.000679
C  -0.665355 1.489747 0.162085
C  1.614934 0.544573 0.057022
C  0.709481 1.660715 0.144199
C  3.065866 0.735426 0.030012
C  1.958109 -1.894291 -0.088984
C  3.934402 -0.416769 -0.056473
C  3.332477 -1.724689 -0.115724
C  3.667523 2.032932 0.087539
C  5.367976 -0.253349 -0.082776
C  5.904579 1.04123 -0.02295
C  5.057206 2.182441 0.061999
C  6.292063 -1.455679 -0.172999
H  -3.532226 1.694046 1.213174
H  -3.238472 2.028935 -0.500682
H  -6.642062 -0.460143 0.459993
H  -5.411907 -0.136975 1.709723
H  -5.107682 -1.847133 -0.838363
H  -4.96575 -2.381912 0.839518
H  -7.012001 2.081261 0.089729
H  -5.58541 3.146178 -0.07464
H  -5.895146 2.297683 1.470655
H  -6.343879 0.538537 -1.893586
H  -4.623419 0.081093 -2.085712
H  -5.10299 1.795975 -2.172694
H  -2.821301 -3.411764 0.044873
H  -0.375784 -3.159783 -0.046046
H  -1.303915 2.37448 0.235163
H  1.107281 2.677598 0.198625
H  1.556658 -2.909908 -0.138933
H  3.978686 -2.605333 -0.183671
H  3.044705 2.929133 0.152881
H  6.992473 1.175764 -0.041912
H  5.500371 3.183463 0.107724
H  7.347382 -1.135635 -0.180401
H  6.155965 -2.14321 0.683419
H  6.113097 -2.043048 -1.093703
