program: Gaussian 09
title: 000123648
version: EM64L-G09RevD.01
frameworkgroup: C1[X(C7H5NO4S)]
method: RPBEPBE
basis: SDD
operation: Freq
keyword: #p
keyword: freq=noraman
keyword: PBEPBE/SDD
title: #p freq=noraman PBEPBE/SDD
converged: YES YES NO NO
title: Mulliken charges:
elementType: S O O O O N C C C C C C C H H H H H
charge: 0.055873 -0.402595 -0.214189 -0.202126 -0.190052 0.024682 0.264970 0.269445 -0.319330 -0.334692 -0.233831 -0.152045 0.102196 0.280792 0.288229 0.242558 0.126725 0.393390
chargesum: 0.00000
title: Mulliken charges with hydrogens summed into heavy atoms:
elementType: S O O O O N C C C C C C C
charge: 0.182598 -0.009204 -0.214189 -0.202126 -0.190052 0.024682 0.264970 0.269445 -0.038538 -0.046463 -0.233831 0.090513 0.102196
polarizability: 1.89923840e+02 4.53292785e+00 1.27572891e+02 5.93805972e-01 -8.67515769e+00 5.31060855e+01
1716.lowfreq: -0.0022 -0.0015 -0.0013 3.0453 6.9199 7.4907 30.0424 80.8092 96.5069
frequency: 29.9975 80.8086 96.5061 125.1452 156.7942 181.0309 182.8615 246.2851 293.9257 308.4836 344.2963 357.9326 432.8641 487.3488 531.1896 578.6318 595.6708 606.8461 658.2928 670.9080 707.8761 755.1205 758.6475 828.5294 834.4340 895.2690 904.9566 971.2393 1024.2533 1060.1676 1102.9838 1153.2126 1168.1493 1220.4616 1269.4290 1308.6218 1364.1256 1388.8420 1402.1425 1462.4959 1573.1140 1597.6324 1651.2178 2448.2987 3145.5560 3159.4566 3182.6401 3524.7953
redmass: 13.4684 9.2572 11.8723 4.9806 8.9011 1.1327 8.1595 5.9385 13.0707 5.8535 6.3627 7.6108 3.6454 4.9107 3.5594 2.2643 2.7133 6.4223 4.6252 7.6540 6.7608 5.0440 7.4311 3.5782 1.8247 1.1494 1.4831 1.3566 4.8581 3.7107 2.0628 2.3508 1.5539 7.4512 1.4000 2.2778 6.9946 8.2414 4.8724 2.7302 7.5731 7.1867 9.9798 1.0383 1.0908 1.0928 1.0951 1.0643
irintensity: 1.1497 3.2136 2.2318 3.5278 1.4341 27.0393 3.1549 1.5104 1.0005 0.9352 5.5111 2.0926 5.4547 3.9061 32.1188 71.4320 80.3641 5.9613 8.7384 4.6577 45.1090 12.3854 5.7212 52.1427 31.1139 10.3297 15.2545 3.4084 143.2307 45.1861 48.8105 9.5121 146.1093 347.8532 1.9892 84.7260 116.5566 71.8631 7.1027 5.2295 103.1211 53.9934 229.5129 10.3117 4.4083 0.5900 2.1867 51.0190
temp: 298.150 k
press: 1.00000 atm
elementType: 16 8 8 8 8 7 6 6 6 6 6 6 6 1 1 1 1 1
symmnumber: 1
zpe: 292065.2 jmol-1
zpe.correction: 0.111242 hartree
zpe.thermalcorrener: 0.123260 hartree
zpe.thermalcorrenthalpy: 0.124204 hartree
zpe.thermalcorrgfe: 0.071847 hartree
zpe.sumelectzpe: -1022.427908 hartree
zpe.sumelectthermal: -1022.415890 hartree
zpe.sumelectthermalent: -1022.414946 hartree
zpe.sumelectthermalfe: -1022.467303 hartree
dipole: 4.8489 -1.1595 1.4729
dipole: 5.1986
quadrupole: -78.9627 -80.3398 -85.8130
quadrupole: -14.7988 -3.5692 6.4682
quadrupole: 2.7425 1.3653 -4.1078 -14.7988 -3.5692 6.4682
hfenergy: -1022.53915 hartree
pointgroup: C01 [X(C7H5N1O4S1)]
dipole: 1.9552035 0.3199474 -0.5079871 debye
dipolederiv: -0.7448984 0.1727307 -0.031465 0.1523778 0.1853266 -0.0267217 -0.0382614 -0.0228445 -0.1075391 -0.6403208 0.0173181 -0.4453754 -0.0632764 -0.3875046 -0.087932 -0.4797069 -0.1720539 -0.903435 -0.4754125 -0.1939098 -0.0481881 -0.1660665 -0.8198144 0.3450565 -0.1374163 0.1208965 -0.6571107 -0.5860138 0.2115953 -0.0184605 0.3385079 -0.7746299 0.220646 -0.0225649 0.1887814 -0.3137112 -0.8471603 -0.06988 0.1575696 -0.1755095 -0.5087838 0.1452919 0.184189 0.1660898 -0.312801 1.8378508 -0.3576007 -0.1484016 -0.371517 1.0410717 -0.4293437 -0.1507556 -0.3571824 0.4096082 0.1438989 -0.2143741 -0.0283945 -0.4735325 0.0033994 -0.0010612 0.1440935 0.0293708 -0.0145027 -0.8341677 0.2669587 -0.0058458 0.3031824 -0.0452018 0.0814794 -0.0559933 -0.031158 0.0176141 -0.633202 0.0836403 -0.0125236 -0.2056096 0.0388641 -0.0132721 0.0482873 -0.0037326 -0.0777369 0.3385866 -0.1808921 0.0216951 0.1153936 -0.0326553 -0.0064541 -0.089228 0.0005275 -0.0686383 1.3482657 -0.3384074 0.0817659 -0.2065784 0.0667718 -0.0154769 0.0607101 -0.0306363 -0.0641463 -0.3936623 0.2596632 -0.026978 0.4162633 -0.1464165 0.0047601 -0.0578584 0.011404 -0.1200429 0.9771705 0.4094304 0.5088387 0.4856057 1.1693019 -0.329721 0.5006099 -0.0747511 1.2204034 0.0966093 0.0284119 -0.0023068 0.0296857 0.0223508 0.0058794 -0.0297038 0.0075701 0.1509072 0.0975395 0.0416585 -0.0073581 0.0015185 0.0477211 0.0006876 0.0246396 0.012982 0.1664963 -0.0340794 -0.0801382 0.0032466 -0.0532752 0.0386037 0.0055741 0.0048308 0.0020847 0.1558978 0.0613868 0.0312782 -0.009184 -0.0601495 -0.1198735 0.0250595 0.0070597 0.0304103 0.1801512 0.2876091 -0.0874831 0.0113656 -0.0670204 0.2214687 0.0755482 0.0870684 0.1222417 0.3385858 unknown
polarizability: 189.0181155|-7.3532021|127.1073487|5.5766241|-12.9660324|54.4773523 unknown
InChI: InChI=1S/C7H5NO4S/c9-7(10)5-3-4(13)1-2-6(5)8(11)12/h1-3,9,13H
charge 0 multiplicity 1
18 atoms
S  4.113003 -0.612211 0.205923
O  -1.807619 -1.627835 -1.146385
O  -1.042063 -2.693421 0.777922
O  -1.974527 2.39457 -0.466858
O  -2.569879 0.447169 0.569071
N  -1.704276 1.222837 0.00521
C  0.014354 -0.620352 0.031142
C  -0.303259 0.759394 -0.059124
C  1.369827 -0.99626 0.118327
C  0.709359 1.739019 -0.115916
C  2.396324 -0.018101 0.082852
C  2.059317 1.35242 -0.050707
C  -0.999504 -1.730839 -0.015972
H  1.61471 -2.059627 0.204114
H  0.423671 2.791441 -0.192753
H  2.839377 2.120269 -0.086873
H  4.721356 0.627478 0.110637
H  -2.49827 -2.344351 -1.134611
