program: Gaussian 09
title: 000123696
version: EM64L-G09RevD.01
frameworkgroup: C1[X(C18H29NO)]
method: RPBEPBE
basis: SDD
operation: Freq
keyword: #p
keyword: freq=noraman
keyword: PBEPBE/SDD
title: #p freq=noraman PBEPBE/SDD
converged: NO YES NO NO
title: Mulliken charges:
elementType: O N C C C C C C C C C C C C C C C C C C H H H H H H H H H H H H H H H H H H H H H H H H H H H H H
charge: -0.276177 -0.147549 0.047572 -0.271204 -0.524063 -0.531993 0.392437 0.117585 -0.750689 -0.392658 -0.320538 -0.465200 0.184581 -0.377535 -0.419826 -0.248984 -0.399032 -0.685711 -0.670926 -0.534757 0.184781 0.222635 0.230265 0.203626 0.240509 0.227579 0.246294 0.212461 0.223834 0.219794 0.209380 0.200271 0.178194 0.235863 0.208813 0.209791 0.202118 0.201081 0.220068 0.238273 0.207434 0.218518 0.207966 0.204769 0.205078 0.235931 0.241047 0.219043 0.219251
chargesum: 0.00000
title: Mulliken charges with hydrogens summed into heavy atoms:
elementType: O N C C C C C C C C C C C C C C C C C C
charge: -0.276177 -0.147549 0.232354 -0.048570 -0.090171 -0.063906 0.392437 0.117585 -0.068101 0.036516 0.057927 -0.229337 0.184581 0.041069 -0.016628 -0.028916 -0.160758 -0.051793 -0.025148 0.144583
polarizability: 2.59206106e+02 -9.33326192e-01 2.03023293e+02 7.33954455e+00 1.42553430e+01 1.52430066e+02
1716.lowfreq: -13.8208 -8.7614 -1.2345 -0.0007 -0.0004 -0.0003 22.8550 24.1833 35.7965
frequency: 20.7136 23.5168 35.4513 51.7809 63.0771 83.1918 96.2308 117.5630 137.0917 167.4620 174.6824 183.3297 191.2163 206.0876 215.5672 227.7952 232.3525 253.0900 273.2306 278.7746 287.3854 319.9585 326.4896 346.9140 366.9612 422.0241 445.9739 471.1703 510.3812 512.2833 538.0885 554.8903 600.3044 618.8218 621.8823 673.8527 718.2082 736.4716 760.8904 781.2417 792.6255 813.1239 824.8658 851.1097 858.7865 869.1986 871.0727 880.2396 897.5416 919.3372 956.4321 965.8362 996.0743 1008.9087 1020.4809 1033.7288 1041.3728 1056.2418 1072.0113 1078.6722 1089.1402 1089.8205 1102.3276 1106.7611 1113.6330 1134.8929 1151.1472 1166.1548 1176.3479 1185.0056 1192.4808 1206.9897 1214.2337 1235.2658 1242.4241 1256.3539 1261.8583 1264.8179 1289.0574 1290.0964 1304.4630 1315.0003 1320.8902 1332.7357 1341.4891 1343.7918 1353.8040 1374.7646 1377.1473 1383.2363 1387.5778 1392.2680 1394.6820 1432.3001 1448.9142 1454.6950 1458.1914 1465.2493 1465.7826 1465.8677 1471.1089 1471.5262 1474.3928 1477.4717 1481.4021 1482.9250 1484.5089 1487.5444 1493.6434 1500.3079 1595.5908 1606.4311 2827.2209 2843.1557 2956.0602 2965.0335 2969.8039 2977.5806 2978.4517 2979.7877 2982.4342 2985.5124 2997.3818 3006.1629 3017.4971 3019.8934 3030.3605 3042.5055 3044.9101 3053.3138 3067.4627 3067.7697 3070.7923 3072.4294 3078.3738 3087.9215 3091.5723 3116.2397 3119.3091 3140.3920 3164.9902
redmass: 3.3780 2.9877 3.5432 2.0064 3.0364 2.8918 2.7394 3.2613 2.8429 2.4945 2.0541 1.6950 1.2006 1.5760 1.4352 1.5512 1.8828 2.8897 2.4806 2.1814 2.7863 3.1743 2.0395 3.3854 3.6502 2.4188 2.9328 5.1018 3.4002 2.9665 4.0458 4.2989 3.0734 2.8354 3.4359 3.6439 1.8821 1.1163 1.5967 1.8218 3.6391 2.2880 2.4349 2.1041 1.6462 1.3968 1.9620 1.7844 1.7337 1.6150 1.3386 2.6782 1.6219 2.6059 1.8008 3.0576 2.2791 2.6037 2.3598 2.4305 1.9488 2.4436 2.0271 1.8925 1.2640 2.2569 1.3971 1.5622 1.8401 1.3217 2.1047 2.2166 1.6433 1.5536 2.2486 1.3471 1.2099 1.2265 1.3921 1.3479 1.3456 1.3452 1.2483 1.5841 1.4910 1.3686 1.3219 1.5528 1.2938 1.1993 1.2088 1.2443 4.2453 1.3137 1.3249 1.7551 1.0799 1.0821 1.0585 1.0559 1.0601 1.2746 1.0675 1.0433 1.1399 1.4270 1.0771 1.0826 1.0769 1.0924 6.6603 7.1820 1.0793 1.0720 1.0329 1.0674 1.0356 1.0516 1.0529 1.0806 1.0520 1.0360 1.0607 1.0637 1.0990 1.0974 1.0891 1.1037 1.1009 1.0923 1.0977 1.1014 1.0992 1.0984 1.0994 1.0993 1.0997 1.0868 1.0992 1.0923 1.0962
irintensity: 0.0142 0.1770 0.6358 0.0514 0.3775 1.4322 0.3439 3.8078 1.4972 2.3938 2.5058 0.7140 0.5227 0.6106 0.0912 0.8930 0.3853 1.0738 0.1361 0.0611 1.1688 0.8910 1.0168 3.0502 3.4027 1.5922 0.6499 4.6837 0.1942 5.5700 2.6653 3.5069 1.6199 5.0375 3.1585 7.7808 17.2866 11.7482 18.0920 49.3070 4.0176 3.1139 3.2295 1.2530 1.9521 0.0609 7.2802 10.3438 6.3528 5.7311 0.5072 13.2590 8.7235 28.3718 95.2145 7.2657 36.5223 4.5061 23.1872 19.1936 5.1258 11.4948 22.0127 7.6102 0.1226 6.2379 2.6358 10.7805 8.5834 0.7322 6.8582 5.4109 31.5273 19.4814 101.7737 10.4312 0.8068 2.5604 1.5777 0.4622 0.7813 3.7720 1.3339 8.8979 6.6570 4.7035 2.1257 8.9416 4.1229 16.4720 12.7498 28.2150 8.5040 23.3081 6.0592 84.9625 4.6607 3.7173 4.8315 10.0927 0.3905 16.0770 20.0726 14.6582 7.8348 2.8546 20.7364 3.9507 0.9641 17.0176 57.0312 25.2436 45.0235 125.6010 81.9220 20.3162 45.4026 20.7490 34.2034 33.0124 31.3244 21.9261 57.4341 25.5152 5.7220 16.1742 17.9993 48.4837 23.0429 33.2208 37.3326 104.3490 45.7432 83.2911 23.0150 54.4693 34.9886 5.9242 26.9171 22.2624 23.4519
temp: 298.150 k
press: 1.00000 atm
elementType: 8 7 6 6 6 6 6 6 6 6 6 6 6 6 6 6 6 6 6 6 1 1 1 1 1 1 1 1 1 1 1 1 1 1 1 1 1 1 1 1 1 1 1 1 1 1 1 1 1
symmnumber: 1
zpe: 1135357.1 jmol-1
zpe.correction: 0.432435 hartree
zpe.thermalcorrener: 0.454383 hartree
zpe.thermalcorrenthalpy: 0.455327 hartree
zpe.thermalcorrgfe: 0.380433 hartree
zpe.sumelectzpe: -831.693483 hartree
zpe.sumelectthermal: -831.671534 hartree
zpe.sumelectthermalent: -831.670590 hartree
zpe.sumelectthermalfe: -831.745484 hartree
dipole: -1.1136 0.1325 -0.9833
dipole: 1.4915
quadrupole: -104.8012 -120.5347 -127.1618
quadrupole: 2.0472 0.2143 2.7576
quadrupole: 12.6980 -3.0355 -9.6625 2.0472 0.2143 2.7576
hfenergy: -832.1259174 hartree
pointgroup: C01 [X(C18H29N1O1)]
dipole: 0.421221 0.0248825 -0.4078126 debye
polarizability: 258.2284881|3.2333532|205.9541921|-11.2757851|-8.3533706|150.4767844 unknown
InChI: InChI=1S/C18H29NO/c1-5-12-19(13-6-2)17-11-10-16-15(14(17)3)8-7-9-18(16)20-4/h7-9,14,17H,5-6,10-13H2,1-4H3
charge 0 multiplicity 1
49 atoms
O  3.823658 1.769383 -0.812528
N  -2.461674 0.253354 0.100441
C  -1.000286 0.317999 -0.232856
C  -0.202218 -0.813053 0.492265
C  -0.353795 1.67795 0.130113
C  1.096803 1.763646 -0.395008
C  1.295333 -0.730048 0.183236
C  1.903496 0.491932 -0.193762
C  -0.428589 -0.819562 2.031567
C  -3.075697 -1.084659 -0.125835
C  -3.27108 1.359919 -0.480902
C  2.090771 -1.899793 0.31978
C  3.310383 0.512844 -0.426462
C  -3.095645 -1.618036 -1.587446
C  -4.725359 1.43263 0.043838
C  3.478525 -1.858317 0.094829
C  4.104665 -0.645977 -0.279329
C  -3.802354 -2.987799 -1.67878
C  -4.812528 1.563022 1.579177
C  5.264793 1.870383 -1.042024
H  -0.845077 0.172884 -1.335799
H  -0.549932 -1.789937 0.101123
H  -0.386174 1.811094 1.227415
H  -0.913196 2.521324 -0.309387
H  1.622499 2.614137 0.077575
H  1.086337 2.001392 -1.479205
H  -1.506375 -0.798878 2.267501
H  0.026287 -1.719423 2.483778
H  0.039192 0.060522 2.506995
H  -2.562157 -1.826364 0.513752
H  -4.116166 -1.04756 0.247582
H  -2.788819 2.314259 -0.210412
H  -3.292997 1.321145 -1.600807
H  1.609734 -2.84389 0.602674
H  -3.609955 -0.891324 -2.24679
H  -2.059575 -1.711416 -1.967832
H  -5.198986 2.314257 -0.433534
H  -5.31154 0.5563 -0.295215
H  4.08196 -2.76655 0.203126
H  5.183997 -0.622112 -0.455687
H  -4.852205 -2.918323 -1.335182
H  -3.81222 -3.37066 -2.715611
H  -3.293772 -3.74101 -1.046979
H  -4.303397 2.482878 1.923647
H  -5.8636 1.604703 1.919819
H  -4.313561 0.710385 2.071721
H  5.440688 2.921515 -1.315497
H  5.589289 1.210496 -1.87046
H  5.838421 1.621939 -0.127423
