program: Gaussian 09
title: 000123630
version: EM64L-G09RevD.01
frameworkgroup: C1[X(C10H12N4O5S)]
method: RPBEPBE
basis: SDD
operation: Freq
keyword: #p
keyword: freq=noraman
keyword: PBEPBE/SDD
title: #p freq=noraman PBEPBE/SDD
converged: YES YES NO NO
title: Mulliken charges:
elementType: S O O O O O N N N N C C C C C C C C C C H H H H H H H H H H H H
charge: 0.945499 -0.505879 -0.539629 -0.163479 -0.415758 -0.187886 -0.159678 -0.081901 -0.045686 -0.082503 -0.007056 -0.288575 -0.173160 -0.533035 0.183316 -0.415672 -0.729612 0.167498 -0.179470 -0.300420 0.322424 0.304871 0.277587 0.306923 0.255521 0.316156 0.247046 0.307003 0.233596 0.394771 0.278686 0.268503
chargesum: 0.00000
title: Mulliken charges with hydrogens summed into heavy atoms:
elementType: S O O O O O N N N N C C C C C C C C C C
charge: 0.945499 -0.505879 -0.539629 -0.163479 -0.020987 -0.187886 -0.159678 -0.081901 -0.045686 -0.082503 -0.007056 0.033849 0.131710 0.051475 0.183316 0.156004 0.058033 0.167498 0.099217 -0.031917
polarizability: 2.03119505e+02 9.55721099e+00 1.68222385e+02 8.67624586e+00 -1.11878512e+01 1.42760894e+02
1716.lowfreq: -11.6990 -6.8302 -0.0008 -0.0005 0.0007 3.1572 16.7379 34.7045 49.0798
frequency: 16.4163 34.4482 48.9675 56.5329 75.0353 84.5158 97.4057 121.1887 152.9330 165.8751 188.5936 191.4666 208.2158 215.4773 224.0000 250.0266 283.1451 293.6447 321.7997 352.6269 373.2371 406.9835 427.0314 441.1886 486.4320 512.2307 526.9856 581.7470 600.7429 616.1959 631.7434 664.7653 681.8589 723.3641 745.4515 764.6734 802.2211 813.8119 842.1064 851.0691 877.3575 898.5128 915.8208 922.5722 937.4636 941.9026 952.5208 975.2468 1001.0827 1033.9900 1037.3052 1053.6945 1064.2223 1080.6894 1082.8475 1126.1609 1146.2585 1153.5937 1173.0341 1179.8419 1196.6587 1214.6661 1253.0277 1263.2655 1280.5509 1308.2880 1314.8076 1357.5911 1377.9908 1401.0971 1414.0803 1425.9672 1436.5622 1459.5593 1462.0288 1470.7307 1681.6698 1755.2667 2964.7730 2984.4910 3021.4580 3039.5902 3052.5595 3079.3878 3097.7076 3122.5562 3130.7736 3240.8780 3266.3124 3518.3304
redmass: 7.3749 5.6404 6.6518 11.6020 8.1971 7.2478 6.7060 6.8824 5.7812 8.6534 1.3107 3.8220 6.9610 7.1574 4.7516 4.0489 3.3863 3.8466 3.7014 7.0390 4.0497 4.2022 10.5875 4.4323 4.3380 4.7103 2.9316 2.3267 4.4587 2.9804 2.0646 7.2907 3.9486 5.5671 6.1879 1.2205 15.8255 4.4416 1.4233 4.7967 4.2463 4.2974 2.3136 3.3000 2.9565 5.0530 2.1675 2.6588 3.7935 2.7529 2.5137 2.2986 1.6003 1.9446 1.5757 2.1890 2.3744 1.3519 2.6491 5.4801 1.8811 1.4780 1.9328 2.1352 4.8168 1.3326 1.7061 1.5069 1.2680 1.1986 1.1197 3.5383 1.4199 1.3708 1.4926 1.0811 9.4046 12.6941 1.0649 1.0375 1.0840 1.0607 1.0967 1.0978 1.0998 1.0982 1.1009 1.0927 1.1094 1.0644
irintensity: 1.4542 3.9197 6.2107 1.8534 4.3591 1.4081 6.1805 1.0351 2.9100 12.9945 5.6179 18.5121 6.4843 3.2975 3.1881 1.5346 3.8630 5.3743 5.8097 24.4090 1.2061 1.9164 31.5770 1.4673 11.6024 4.7595 0.9395 58.5307 53.8575 14.7950 48.2334 1.2463 36.8318 4.4766 2.6217 69.6309 66.9093 3.6129 1.7702 31.3647 15.6851 20.0892 39.4532 7.6139 11.8630 26.0133 32.0991 7.7595 19.7357 113.0278 50.1705 113.0271 105.4831 10.8496 81.9832 31.6073 5.4150 12.1825 11.8278 5.6035 1.8049 37.4220 28.7509 15.6678 58.8763 2.7192 8.8800 31.7526 9.8503 23.5298 27.8019 11.0043 21.9014 21.9251 0.4102 35.3023 195.2051 446.6751 6.1272 8.8695 3.3290 5.2581 1.5002 5.8257 3.6718 0.3255 1.4939 1.4839 0.2818 42.3426
temp: 298.150 k
press: 1.00000 atm
elementType: 16 8 8 8 8 8 7 7 7 7 6 6 6 6 6 6 6 6 6 6 1 1 1 1 1 1 1 1 1 1 1 1
symmnumber: 1
zpe: 592288.5 jmol-1
zpe.correction: 0.225591 hartree
zpe.thermalcorrener: 0.245121 hartree
zpe.thermalcorrenthalpy: 0.246065 hartree
zpe.thermalcorrgfe: 0.175899 hartree
zpe.sumelectzpe: -1379.738350 hartree
zpe.sumelectthermal: -1379.718820 hartree
zpe.sumelectthermalent: -1379.717876 hartree
zpe.sumelectthermalfe: -1379.788042 hartree
dipole: -1.2200 7.2522 -0.8972
dipole: 7.4086
quadrupole: -129.0930 -119.8475 -134.1940
quadrupole: 23.5412 -16.0594 -1.5325
quadrupole: -1.3815 7.8640 -6.4825 23.5412 -16.0594 -1.5325
hfenergy: -1379.9639407 hartree
pointgroup: C01 [X(C10H12N4O5S1)]
dipole: -0.728857 2.802507 -0.332634 debye
polarizability: 200.775037|12.5817753|170.4542628|10.7891836|-9.824188|142.8734843 unknown
InChI: InChI=1S/C10H12N4O5S/c1-10(5-13-3-2-11-12-13)8(9(16)17)14-6(15)4-7(14)20(10,18)19/h2-3,7-8,16H,4-5H2,1H3
charge 0 multiplicity 1
32 atoms
S  -0.107939 -1.606106 0.743244
O  0.545638 -2.052654 2.163807
O  0.147161 -2.405925 -0.667967
O  -3.304228 -0.709728 -2.150211
O  -1.119449 3.265799 0.037804
O  -2.593678 2.225551 1.515554
N  -2.268455 -0.212351 0.0007
N  2.515481 0.4342 -0.496519
N  2.96516 -0.650409 0.293096
N  4.296163 -0.491297 0.434655
C  0.131057 0.461652 0.327581
C  -2.09211 -1.343383 0.895637
C  -1.310997 0.890155 -0.150933
C  -2.904468 -2.245685 -0.067797
C  -2.933746 -1.001317 -1.007799
C  1.100949 0.526533 -0.866239
C  0.618609 1.02917 1.654796
C  -1.780066 2.156532 0.578692
C  3.5700 1.25365 -0.841735
C  4.692233 0.659949 -0.25179
H  -2.289264 -1.240766 1.970243
H  -1.280584 1.129091 -1.231037
H  -3.882612 -2.585717 0.303401
H  -2.327421 -3.081783 -0.498461
H  0.957027 1.490412 -1.387046
H  0.857623 -0.298712 -1.568488
H  -0.17995 1.036857 2.416426
H  1.450465 0.42073 2.048403
H  0.979647 2.066159 1.51728
H  -1.399193 4.096214 0.51023
H  3.45882 2.144269 -1.453348
H  5.732228 0.972612 -0.272378
