program: Gaussian 09
title: 000123702
version: EM64L-G09RevD.01
frameworkgroup: C1[X(C15H30NO4)]
method: RPBEPBE
basis: SDD
operation: Freq
keyword: #p
keyword: freq=noraman
keyword: PBEPBE/SDD
title: #p freq=noraman PBEPBE/SDD
converged: YES YES NO NO
title: Mulliken charges:
elementType: O O O O N C C C C C C C C C C C C C C C H H H H H H H H H H H H H H H H H H H H H H H H H H H H H H
charge: -0.325686 -0.208367 -0.393962 -0.245958 -0.100287 -0.429920 -0.001656 -0.580688 -0.554455 -0.561863 -0.545214 -0.403071 -0.356967 -0.532330 -0.367527 0.283134 -0.355800 0.237480 -0.354734 -0.690824 0.259592 0.342397 0.279292 0.263504 0.290982 0.270425 0.280443 0.267388 0.265527 0.314648 0.266194 0.251169 0.315470 0.266589 0.237461 0.231794 0.199471 0.191186 0.251998 0.232831 0.196582 0.199436 0.182845 0.184984 0.200618 0.201085 0.208233 0.205996 0.229180 0.401376
chargesum: 1.00000
title: Mulliken charges with hydrogens summed into heavy atoms:
elementType: O O O O N C C C C C C C C C C C C C C C
charge: -0.325686 -0.208367 0.007414 -0.245958 -0.100287 0.172068 0.277636 0.244223 0.258902 0.270148 0.036844 0.066185 0.033691 -0.047500 0.028491 0.283134 0.012029 0.237480 0.046969 -0.047415
polarizability: 2.15363111e+02 -1.08976543e+00 1.69522113e+02 3.24499431e+00 1.33633144e+00 1.53250869e+02
1716.lowfreq: -12.6243 -1.9526 -0.0006 0.0002 0.0006 4.9409 13.8968 21.2008 29.1622
frequency: 12.3461 20.1306 28.3753 39.6458 41.4025 46.6621 50.1117 71.1643 83.6514 90.5069 101.4981 111.2720 132.3592 176.1804 178.5678 198.6104 207.0812 219.0020 226.2856 234.3901 251.5650 262.8433 284.2870 301.1176 306.5748 346.3353 359.2252 385.7419 402.7731 412.6007 429.1491 460.2048 472.8407 494.5285 511.3312 532.4534 584.6246 660.5834 674.8180 683.5590 724.9616 738.8562 753.6119 768.5824 788.8615 821.5546 850.2663 855.5260 871.3885 890.2436 905.7880 913.5799 926.5661 947.2595 958.0834 994.6427 1008.2155 1012.6787 1036.6925 1049.1910 1051.1188 1053.6555 1069.0092 1076.0810 1085.4440 1096.7366 1111.9109 1115.0844 1126.2588 1134.4868 1192.5412 1193.6561 1203.5329 1217.9005 1229.8199 1240.9601 1246.7674 1255.0986 1263.5326 1279.7487 1286.7551 1291.6205 1294.8496 1297.3195 1309.1224 1318.2593 1334.8724 1344.7029 1352.3358 1356.7877 1371.5720 1388.4832 1394.1575 1422.3256 1424.2204 1442.1445 1445.4748 1451.3616 1451.7897 1459.3465 1461.5365 1463.2344 1467.2272 1472.8513 1473.4832 1475.1867 1477.6315 1481.0268 1482.2744 1488.0882 1490.5443 1503.8353 1648.8021 1665.8309 2943.1948 2950.2878 2965.1629 2973.0768 2974.0595 2984.7627 2995.2440 2996.4974 3004.3177 3007.3985 3019.0933 3020.9998 3021.0986 3023.1482 3026.6309 3029.2448 3036.7328 3060.1505 3068.2456 3078.3246 3084.7087 3095.0564 3096.4716 3138.2163 3141.0059 3143.4095 3146.2217 3153.7200 3166.5733 3507.3869
redmass: 4.3595 3.5105 1.8083 4.0443 4.6422 4.7990 6.1520 4.2973 3.3048 3.3452 3.5688 1.7937 2.3536 2.8364 4.3356 2.3266 1.3308 2.3517 1.2242 2.4869 2.9146 1.9417 1.7427 1.0660 3.6108 2.4408 3.2754 2.5311 2.6045 2.6915 2.2127 2.7639 3.3557 3.5173 2.2431 3.5204 3.6085 1.6681 2.3925 3.0168 1.0777 1.2063 4.0376 2.8141 1.6786 3.3632 1.6798 3.2399 2.8532 1.9032 1.4503 3.0577 2.4053 2.7976 2.8586 1.3345 1.9461 3.4070 2.7000 2.2876 1.4518 2.2389 2.1386 2.4822 2.2143 1.4656 1.3804 2.0334 2.0234 1.6321 1.3847 1.5827 1.3115 1.5849 1.5212 1.3354 1.3025 1.8826 1.7185 1.1987 1.0608 1.2786 1.6355 1.1115 1.2997 1.2694 1.3825 1.3106 1.6177 1.5643 1.4258 1.2142 1.6215 1.1408 1.1568 1.0844 1.1069 1.0540 1.1184 1.0771 1.0770 1.0734 1.0707 1.0494 1.0739 1.0560 1.0432 1.0798 1.0661 1.0935 1.0540 1.0531 8.1865 10.1398 1.0584 1.0585 1.0593 1.0368 1.0589 1.0980 1.0979 1.0620 1.0677 1.0612 1.0614 1.1011 1.0769 1.0357 1.0337 1.0351 1.1044 1.1040 1.1011 1.0989 1.1013 1.1062 1.0948 1.1054 1.1058 1.1054 1.1052 1.1054 1.1048 1.0644
irintensity: 1.5202 0.9023 0.2893 0.9437 3.3405 0.0188 1.8508 0.5804 1.2545 2.3453 1.7060 0.0503 0.0691 2.6394 2.0144 5.9608 1.7954 2.9262 0.4020 0.9270 1.8752 4.9927 4.1351 0.5800 1.4948 0.5904 4.3912 1.2370 0.1425 1.5068 0.0760 6.5859 0.2515 12.1942 26.7776 42.3798 6.2377 136.9309 52.8030 2.8730 15.0073 1.0473 0.4793 35.5315 5.2987 18.6563 6.9956 27.8838 23.2552 8.6830 17.6879 21.9532 51.0614 10.6297 67.0810 2.0035 9.1863 37.4718 83.3383 16.7334 8.9919 98.2254 178.4998 4.5367 14.0593 79.5843 9.2474 4.0757 90.2085 18.9626 8.3048 3.4058 9.2331 4.9712 3.2911 4.8045 2.9809 1.4369 6.3793 4.1084 2.6437 0.8631 3.5416 0.3692 16.1108 44.5420 2.3359 3.2849 1.9612 0.9371 52.9150 11.5514 29.5234 17.3642 13.7649 42.7830 13.3227 0.9441 9.3426 4.2269 7.0229 0.4983 3.5523 2.9484 4.1501 0.5023 14.2561 2.8959 38.2040 25.5111 38.6730 74.0955 177.5702 162.7554 10.7099 29.6754 24.7829 29.3233 84.0170 6.2394 2.1513 39.3208 2.8132 11.8944 22.5254 1.3298 5.7321 1.5958 9.4781 15.0498 58.9511 27.2149 95.5936 47.1884 22.2045 14.2687 0.7375 0.1537 1.6119 4.5704 9.3570 2.4982 4.4194 56.0486
temp: 298.150 k
press: 1.00000 atm
elementType: 8 8 8 8 7 6 6 6 6 6 6 6 6 6 6 6 6 6 6 6 1 1 1 1 1 1 1 1 1 1 1 1 1 1 1 1 1 1 1 1 1 1 1 1 1 1 1 1 1 1
symmnumber: 1
zpe: 1151320.7 jmol-1
zpe.correction: 0.438515 hartree
zpe.thermalcorrener: 0.463406 hartree
zpe.thermalcorrenthalpy: 0.464350 hartree
zpe.thermalcorrgfe: 0.380199 hartree
zpe.sumelectzpe: -943.372198 hartree
zpe.sumelectthermal: -943.347306 hartree
zpe.sumelectthermalent: -943.346362 hartree
zpe.sumelectthermalfe: -943.430513 hartree
dipole: -15.0730 -0.8163 -1.8893
dipole: 15.2129
quadrupole: -27.9787 -109.0996 -118.2553
quadrupole: 3.0818 4.1936 -8.7868
quadrupole: 57.1325 -23.9884 -33.1441 3.0818 4.1936 -8.7868
hfenergy: -943.8107126 hartree
pointgroup: C01 [X(C15H30N1O4)]
dipole: -5.9359927 0.0022082 -0.7660107 debye
polarizability: 215.1597093|-3.3653853|169.3766776|3.2305325|2.5786088|153.5997057 unknown
InChI: InChI=1S/C15H30NO4/c1-5-6-7-8-9-10-15(19)20-13(11-14(17)18)12-16(2,3)4/h13,17H,5-12H2,1-4H3
charge 1 multiplicity 1
50 atoms
O  -1.24213 0.676467 0.144837
O  -0.497583 1.708772 2.104078
O  1.116372 -2.449792 0.697725
O  -0.675944 -2.438953 -0.775088
N  -4.134293 -0.020404 -0.368494
C  -3.046705 -0.981813 0.176895
C  -1.915284 -0.342947 0.997233
C  -4.519343 1.050643 0.648391
C  -5.370009 -0.862765 -0.6949
C  -3.648924 0.648535 -1.661189
C  -0.88962 -1.399504 1.469031
C  1.810158 2.471239 0.144801
C  2.389064 1.071136 -0.154344
C  0.271751 2.570888 -0.08778
C  3.926008 1.013829 -0.00761
C  -0.484496 1.671672 0.859028
C  4.503709 -0.397171 -0.263413
C  -0.180364 -2.131014 0.334835
C  6.042528 -0.459572 -0.130846
C  6.611567 -1.871686 -0.385759
H  -3.569633 -1.707765 0.82501
H  -2.625409 -1.519389 -0.688883
H  -2.294736 0.163506 1.904857
H  -5.382868 1.610208 0.256927
H  -3.673045 1.73606 0.795557
H  -4.79068 0.570659 1.60129
H  -5.069927 -1.700282 -1.342774
H  -5.804149 -1.248865 0.23999
H  -6.105571 -0.232257 -1.217313
H  -2.689795 1.141485 -1.457634
H  -3.510637 -0.129407 -2.427512
H  -4.411376 1.372128 -1.989216
H  -0.14233 -0.912356 2.115115
H  -1.395951 -2.158727 2.098321
H  2.034422 2.760568 1.188985
H  2.293364 3.22244 -0.508359
H  1.940065 0.322722 0.532138
H  2.108205 0.765272 -1.184203
H  -0.050812 3.61209 0.104775
H  0.02358 2.310018 -1.130266
H  4.390728 1.733628 -0.712535
H  4.211282 1.346512 1.011506
H  4.047117 -1.114202 0.452331
H  4.213496 -0.73554 -1.2810
H  6.498243 0.257546 -0.843112
H  6.334778 -0.118851 0.882848
H  6.359572 -2.224849 -1.403754
H  6.202415 -2.60306 0.336918
H  7.711976 -1.885865 -0.289253
H  1.577313 -2.957888 -0.025483
