program: Gaussian 09
title: 000123580
version: EM64L-G09RevD.01
frameworkgroup: C1[X(C9H9F3O)]
method: RPBEPBE
basis: SDD
operation: Freq
keyword: #pfreq=noraman
keyword: PBEPBE/SDD
title: #p freq=noraman PBEPBE/SDD
converged: YES YES NO NO
title: Mulliken charges:
elementType: F F F O C C C C C C C C C H H H H H H H H H
charge: -0.168794 -0.147273 -0.153809 -0.433993 0.024772 0.323257 0.411876 -0.752201 -0.361520 -0.353905 -0.235349 -0.225919 -0.230346 0.227986 0.233376 0.270913 0.237267 0.282945 0.353345 0.230568 0.232692 0.234112
chargesum: 0.00000
title: Mulliken charges with hydrogens summed into heavy atoms:
elementType: F F F O C C C C C C C C C
charge: -0.168794 -0.147273 -0.153809 -0.080647 0.024772 0.323257 0.411876 -0.019926 -0.124253 -0.070960 -0.004781 0.006773 0.003766
polarizability: 1.21818083e+02 6.10530051e+00 9.89153575e+01 1.23175602e+01 -1.02061644e+01 6.77595014e+01
1716.lowfreq: -12.2562 -2.1539 0.0009 0.0009 0.0011 8.4690 40.2876 59.1952 88.8593
frequency: 40.0151 59.1711 88.8502 195.2471 201.5592 223.4254 235.4664 269.6698 288.2100 312.5532 332.6291 337.9674 404.1113 430.4823 460.2562 475.2794 536.2252 574.3265 608.3163 615.7335 681.1833 703.9018 760.8690 803.8595 855.2986 885.1183 932.0731 982.1900 990.3204 1001.4064 1017.5541 1022.7385 1036.0703 1060.4934 1076.0312 1087.6596 1111.4028 1150.7644 1175.7386 1194.5923 1233.3661 1320.2145 1327.1748 1382.3632 1395.2714 1436.1507 1467.8622 1480.3211 1485.1803 1591.9610 1612.6321 3005.4959 3103.1251 3120.0515 3129.6258 3139.8122 3153.4318 3162.4093 3171.8137 3568.7331
redmass: 4.3156 10.5991 6.7969 1.5746 4.8272 2.6644 3.3445 1.1991 5.1449 4.2141 5.3217 4.0122 2.8127 5.4016 10.0149 5.2385 7.9343 4.5478 5.7985 6.4498 7.5960 1.7623 2.1642 2.5185 1.2515 2.8089 1.4054 1.3958 5.7978 1.3336 3.7874 3.1642 3.5621 2.6524 2.5819 2.4071 2.1113 2.5747 1.0519 1.1214 3.9810 1.3368 2.0046 8.4743 1.2061 2.1986 1.0536 1.6349 1.2780 6.1073 6.0251 1.0361 1.1000 1.1002 1.0851 1.0886 1.0928 1.0955 1.1008 1.0663
irintensity: 2.3379 1.5623 0.6424 96.5847 6.3069 52.1862 12.2970 5.8684 1.3624 2.9530 4.1041 0.8613 1.0776 1.5967 7.3794 1.3383 1.1428 24.2654 28.7160 1.5046 0.2859 55.4484 57.3970 4.3918 1.2794 27.3003 3.6199 3.0884 2.1219 0.4621 206.2445 105.6352 123.1785 73.3977 70.5675 16.9909 42.9808 75.4849 0.0371 2.3902 34.6934 1.1133 29.5416 0.2186 22.7553 15.0453 6.6968 21.4281 12.0597 0.5818 0.0602 7.6077 14.9565 11.9591 0.0594 7.3337 21.2515 18.7927 10.5628 15.5786
temp: 298.150 k
press: 1.00000 atm
elementType: 9 9 9 8 6 6 6 6 6 6 6 6 6 1 1 1 1 1 1 1 1 1
symmnumber: 1
zpe: 421718.1 jmol-1
zpe.correction: 0.160624 hartree
zpe.thermalcorrener: 0.172888 hartree
zpe.thermalcorrenthalpy: 0.173832 hartree
zpe.thermalcorrgfe: 0.122068 hartree
zpe.sumelectzpe: -722.136876 hartree
zpe.sumelectthermal: -722.124612 hartree
zpe.sumelectthermalent: -722.123668 hartree
zpe.sumelectthermalfe: -722.175432 hartree
dipole: -3.5792 2.2134 1.8493
dipole: 4.5967
quadrupole: -74.7282 -69.7281 -75.0648
quadrupole: 4.3025 1.5118 -0.6447
quadrupole: -1.5545 3.4456 -1.8911 4.3025 1.5118 -0.6447
hfenergy: -722.2974996 hartree
pointgroup: C01 [X(C9H9F3O1)]
dipole: -1.4161106 0.7973607 0.7933711 debye
dipolederiv: -0.3763229 0.0278807 0.0184589 0.0742275 -0.4220225 0.1589832 -0.002525 0.2200207 -0.6609952 -0.3817533 -0.0046283 0.0346318 -0.0876633 -0.7341341 -0.1446216 0.0485019 -0.2147871 -0.3562006 -0.9959619 -0.0239333 -0.1429611 0.0284234 -0.2824657 -0.0397886 0.0435278 -0.0408066 -0.3338475 -0.5116134 -0.1014651 -0.2029394 -0.1254899 -0.5362677 0.1357991 -0.2417003 0.1713165 -0.5994119 0.4474422 0.1066556 0.1320427 0.1117509 0.3695289 -0.1160143 0.1581015 -0.1233249 0.4521486 0.0222592 -0.0022213 -0.0391708 -0.0434825 -0.0860424 -0.0127276 -0.0192113 -0.0165354 -0.174686 1.5966981 -0.0261496 0.0557342 -0.0098098 1.3245013 0.0073945 -0.1805054 0.0579884 1.2944628 -0.0911238 -0.0590092 -0.0122557 -0.0509465 -0.1412872 0.0156781 -0.0274464 -0.0664045 -0.034968 -0.0513483 0.0925206 -0.0020862 0.0066529 0.0276068 -0.0253621 -0.002883 -0.0247405 -0.1165275 -0.0700532 -0.1127982 0.021174 -0.0123841 -0.0057676 -0.018696 0.019502 -0.012964 -0.1300312 -0.0516188 -0.1038825 0.0356626 -0.11221 0.0425311 -0.0706836 0.0583479 -0.0697883 -0.1147938 -0.0465885 0.1144933 0.0091826 0.0937309 0.0992908 -0.0263652 0.0103154 -0.0100711 -0.1371026 0.0991292 0.0168125 0.0594556 0.0327439 -0.0397007 -0.004464 0.0631095 -0.0173243 -0.1308113 0.0235375 0.0483316 0.1174634 0.0348451 0.0489565 -0.0431363 0.1109448 -0.0467145 -0.007091 0.124242 0.0279362 -0.0223094 -0.0041531 0.0136701 0.0871876 -0.0162644 0.1046965 -0.022439 -0.0742344 -0.0302718 -0.0739457 0.0077573 0.0970196 0.0068179 -0.0654213 -0.0110117 0.0976999 0.0756203 -0.086681 0.0039512 -0.0863702 -0.04549 0.0096181 0.0025668 0.0208363 0.1339679 0.0834486 0.0662965 -0.0310701 0.0607049 0.0270597 0.0349569 -0.0260456 0.03348 0.1362924 0.2262371 0.081114 0.170163 0.1092876 0.2617649 -0.0403879 0.2026282 -0.0418224 0.2835241 0.021193 0.0737048 -0.0503233 0.0893345 -0.0396048 0.0610937 -0.0536549 0.0581856 0.1324384 0.0393738 -0.0803596 -0.0158775 -0.0935929 -0.0718924 0.0186782 -0.0189453 0.0230124 0.1463651 -0.1085624 -0.0243461 -0.0649808 -0.0233564 0.0927456 0.0060399 -0.0629431 0.0067588 0.1420065 unknown
polarizability: 121.4042769|4.6418496|100.6969817|13.8865059|-6.5600717|66.3916835 unknown
InChI: InChI=1S/C9H9F3O/c1-8(13,9(10,11)12)7-5-3-2-4-6-7/h2-6,13H,1H3
charge 0 multiplicity 1
22 atoms
F  1.613082 0.545517 -1.636001
F  1.552777 -1.577121 -0.84088
F  3.18703 -0.167647 -0.172864
O  1.244881 -0.670796 1.786139
C  0.916215 0.266141 0.691707
C  -0.570442 0.149581 0.308436
C  1.81126 -0.245407 -0.474643
C  1.367331 1.692253 1.071876
C  -1.329652 1.271303 -0.106706
C  -1.20039 -1.121282 0.381994
C  -2.696173 1.12868 -0.435475
C  -2.565016 -1.262122 0.051854
C  -3.318594 -0.137372 -0.356514
H  0.710945 2.08967 1.865107
H  1.338251 2.384308 0.213344
H  2.399842 1.651879 1.4532
H  -0.863612 2.258701 -0.181423
H  -0.612442 -1.992802 0.6865
H  0.58183 -0.535529 2.509975
H  -3.271634 2.004198 -0.755526
H  -3.038046 -2.248659 0.108044
H  -4.377943 -0.247295 -0.613545
