program: Gaussian 09
title: 000014761
version: EM64L-G09RevD.01
frameworkgroup: C1[X(C18H24O3S)]
method: RPBEPBE
basis: SDD
operation: Freq
keyword: #p
keyword: freq=noraman
keyword: PBEPBE/SDD
title: #p freq=noraman PBEPBE/SDD
converged: NO YES NO NO
title: Mulliken charges:
elementType: S O O O C C C C C C C C C C C C C C C C C C H H H H H H H H H H H H H H H H H H H H H H H H
charge: 0.889717 -0.558708 -0.538259 -0.485442 0.108042 0.522615 0.106312 -0.468157 0.397111 0.533950 0.432635 -0.484567 -0.737992 -0.708976 -0.714886 -0.381298 -0.510934 -0.432562 -0.704221 -0.702388 -0.754739 -0.494579 0.285680 0.229000 0.209975 0.227198 0.207750 0.211150 0.278900 0.212117 0.219439 0.258274 0.256451 0.212972 0.213098 0.229702 0.211700 0.213110 0.228265 0.216175 0.230835 0.230157 0.239292 0.244476 0.243410 0.378199
chargesum: 0.00000
title: Mulliken charges with hydrogens summed into heavy atoms:
elementType: S O O O C C C C C C C C C C C C C C C C C C
charge: 0.889717 -0.180509 -0.538259 -0.485442 0.108042 0.522615 0.106312 -0.468157 0.397111 0.533950 0.432635 -0.198887 -0.071818 -0.011176 -0.025056 -0.124847 -0.266458 -0.193270 -0.048449 -0.049313 -0.077572 -0.251169
polarizability: 3.36503438e+02 4.38856595e-01 2.38324620e+02 -6.77257976e-01 -3.17207687e+00 1.54588469e+02
1716.lowfreq: -19.3767 -12.1641 -0.0003 0.0013 0.0013 3.8129 6.5638 28.7096 46.4198
frequency: -14.9718 28.1298 46.2647 75.4370 93.0895 98.7374 113.6210 137.8617 158.9647 176.6929 180.1126 185.1342 205.8472 212.6329 216.4887 219.0704 231.4110 250.2966 258.7983 264.0498 286.5682 299.9793 306.4927 324.6729 328.5189 333.2362 340.1276 357.6336 377.4053 398.1240 404.1284 412.0098 417.3102 459.1163 465.3466 491.4656 500.7916 514.2045 532.6751 548.7957 623.1793 627.9559 640.9882 673.3230 687.3998 783.4803 789.0899 800.8195 810.6786 825.2740 831.4232 859.0463 897.2014 915.3038 920.2003 922.9907 925.4067 932.0207 939.4274 942.9930 943.2558 947.5648 966.4860 983.8173 1019.7918 1021.9626 1022.9951 1032.6732 1081.6843 1111.5396 1124.1092 1139.1722 1180.2953 1201.1855 1203.8770 1209.5258 1216.0740 1232.7779 1252.3490 1266.5385 1288.7254 1321.5976 1355.1830 1373.7922 1373.9083 1376.6713 1383.3834 1400.5907 1402.5305 1409.1485 1411.0065 1451.4963 1454.6055 1460.6918 1464.4118 1466.8314 1471.7185 1475.1795 1480.4787 1486.9828 1491.7597 1498.7930 1500.0332 1513.6204 1516.6054 1539.1437 1607.3041 1631.3219 2973.6686 2974.8897 2976.3339 2979.9338 2980.1580 2990.2733 3066.1423 3069.0570 3070.3175 3071.7156 3073.8898 3074.8497 3077.9544 3080.1511 3080.8766 3083.5289 3119.1976 3123.4514 3128.6170 3132.5183 3149.4698 3197.3754 3218.3427 3449.1103
redmass: 3.8800 2.9576 7.2152 3.5690 4.1868 4.7158 2.7257 1.6748 3.3560 3.6297 4.9463 3.0425 1.6300 1.5011 2.7194 1.2643 1.9741 1.1982 2.5102 3.1185 2.9839 7.0910 1.0807 2.8953 2.3924 2.7797 2.2097 1.6972 2.5433 3.0454 2.8180 2.6421 7.8396 3.3347 3.2222 2.9761 3.1877 4.4570 3.9793 4.5656 5.9283 4.3653 5.2353 5.5595 2.8692 5.5845 3.3144 3.3276 1.4280 4.6679 4.2222 1.6245 1.8332 2.6320 1.7605 2.4015 1.8996 1.6484 3.9858 1.3213 3.0215 1.2560 1.3488 1.4309 1.4022 1.3906 1.4149 1.3654 1.2470 2.2697 2.7848 2.0406 1.3598 2.9508 2.9460 2.1294 2.6449 2.4944 1.8599 2.6082 2.4719 1.9566 5.7023 1.1886 1.1901 1.2694 1.1721 2.7094 1.5773 1.2103 1.8727 1.1234 1.6575 1.0503 1.0496 1.0686 1.1508 1.0648 1.0907 1.0493 1.0793 1.0751 1.0738 1.4270 1.6116 6.7501 6.6168 6.1681 1.0344 1.0348 1.0356 1.0360 1.0372 1.0392 1.0996 1.1000 1.1000 1.0994 1.1011 1.1000 1.0985 1.0996 1.0997 1.0987 1.0978 1.0870 1.0956 1.0907 1.0967 1.0915 1.0898 1.0659
irintensity: 0.2313 0.0718 0.7972 0.0338 0.7199 1.1236 0.5391 3.6768 3.7129 1.0746 1.7143 0.9548 22.4236 13.0975 7.5884 5.5985 15.4580 0.1206 3.8474 4.3339 6.0385 11.5306 0.0439 28.0427 2.3993 1.9676 0.1045 2.2804 0.1578 2.8032 3.9475 6.0429 63.0372 4.1603 0.8507 7.6425 4.9924 61.4995 24.8361 24.6800 3.5408 12.5398 1.6894 3.4303 3.5316 6.2346 5.7805 0.4311 0.0195 60.6844 16.0679 58.7164 5.5540 0.1717 3.7861 20.1065 16.9829 2.2654 12.4489 14.1965 65.4920 0.7912 0.1386 2.2685 2.0616 0.2978 2.5753 0.6535 50.0039 10.8882 44.4095 4.8245 17.4822 3.9189 7.3627 18.8430 1.6488 12.2257 14.3387 30.1920 32.7720 1.6201 16.3582 20.8072 10.3070 21.9282 27.0287 10.5876 16.6131 22.8332 5.1469 0.5035 0.1181 0.0483 0.8031 5.2211 2.3553 5.2154 20.0599 13.8202 11.1750 21.1006 17.3864 49.0408 13.0266 2.2028 4.6395 45.3874 30.0260 31.7673 16.4856 48.6878 35.0569 41.4847 11.0339 2.6131 7.4905 12.1868 0.7387 40.4960 115.7473 38.2792 55.4942 72.8703 1.1565 4.4014 5.8770 9.7207 29.6914 5.8944 1.0503 43.0486
temp: 298.150 k
press: 1.00000 atm
elementType: 16 8 8 8 6 6 6 6 6 6 6 6 6 6 6 6 6 6 6 6 6 6 1 1 1 1 1 1 1 1 1 1 1 1 1 1 1 1 1 1 1 1 1 1 1 1
symmnumber: 1
zpe: 983967.1 jmol-1
zpe.correction: 0.374773 hartree
zpe.thermalcorrener: 0.398024 hartree
zpe.thermalcorrenthalpy: 0.398968 hartree
zpe.thermalcorrgfe: 0.324768 hartree
zpe.sumelectzpe: -1322.211608 hartree
zpe.sumelectthermal: -1322.188357 hartree
zpe.sumelectthermalent: -1322.187413 hartree
zpe.sumelectthermalfe: -1322.261613 hartree
dipole: -0.5964 4.2463 -1.1251
dipole: 4.4331
quadrupole: -124.9759 -137.0712 -145.6931
quadrupole: 6.6423 0.8544 4.9160
quadrupole: 10.9375 -1.1578 -9.7797 6.6423 0.8544 4.9160
hfenergy: -1322.5863814 hartree
pointgroup: C01 [X(C18H24O3S1)]
dipole: -0.2555202 1.7141435 -0.1959895 debye
polarizability: 336.1946291|1.6193478|237.5858299|-7.3275762|8.45983|155.6360679 unknown
InChI: InChI=1S/C18H24O3S/c1-17(2,3)13-9-7-12-8-10-15(18(4,5)6)16(14(12)11-13)22(19,20)21/h7-11,19H,1-6H3
charge 0 multiplicity 1
46 atoms
S  1.063934 -2.007078 -0.445877
O  -0.140251 -2.044477 -1.887447
O  2.377602 -2.698113 -1.105076
O  0.385179 -2.754954 0.8156
C  3.748266 0.157891 -0.002694
C  2.270312 0.662775 -0.080841
C  -4.04063 -0.551216 0.157604
C  1.073993 -0.081254 -0.169394
C  -0.266472 0.4559 -0.065543
C  -2.74096 0.28178 0.093079
C  -0.379504 1.899705 0.001576
C  -1.477877 -0.313262 0.000829
C  4.70984 1.291383 0.474578
C  4.245157 -0.280237 -1.415858
C  3.899971 -0.985036 1.049068
C  2.06248 2.09026 -0.02346
C  0.807859 2.684661 -0.009881
C  -2.825256 1.716687 0.126638
C  -4.9374 -0.183921 -1.064528
C  -4.801529 -0.217047 1.476775
C  -3.770675 -2.077159 0.120846
C  -1.677379 2.498534 0.086355
H  -1.421241 -1.39962 -0.012015
H  5.712696 0.849679 0.611399
H  4.818617 2.103296 -0.26725
H  4.399037 1.726382 1.442154
H  4.158855 0.558502 -2.131335
H  5.311551 -0.568291 -1.354102
H  3.682022 -1.143456 -1.799693
H  4.974012 -1.214392 1.174849
H  3.502825 -0.668491 2.030813
H  3.416216 -1.92538 0.749994
H  2.942124 2.732724 0.017962
H  -5.884024 -0.754349 -1.021915
H  -5.191673 0.89121 -1.083388
H  -4.426465 -0.430278 -2.012957
H  -5.064204 0.854211 1.543965
H  -5.740848 -0.798531 1.526765
H  -4.188539 -0.473749 2.359808
H  -4.732935 -2.619539 0.159728
H  -3.249855 -2.37897 -0.806094
H  -3.162481 -2.410484 0.981615
H  -3.804777 2.202159 0.193779
H  0.723333 3.777089 0.019483
H  -1.744822 3.591949 0.126483
H  0.226317 -2.779694 -2.463694
