program: Gaussian 09
title: 000123564
version: EM64L-G09RevD.01
frameworkgroup: C1[X(C7H15F3O3SSi)]
method: RPBEPBE
basis: SDD
operation: Freq
keyword: #p
keyword: freq=noraman
keyword: PBEPBE/SDD
title: #p freq=noraman PBEPBE/SDD
converged: YES YES NO NO
title: Mulliken charges:
elementType: S Si F F F O O O C C C C C C C H H H H H H H H H H H H H H H
charge: 1.076293 1.418704 -0.120293 -0.116962 -0.109198 -0.721635 -0.467692 -0.503661 -0.168620 -0.700204 -0.686080 -0.686368 -1.056845 -1.054414 0.337812 0.218765 0.228456 0.219921 0.245473 0.210411 0.213252 0.248479 0.212317 0.211291 0.258490 0.275613 0.243693 0.277136 0.254109 0.241757
chargesum: 0.00000
title: Mulliken charges with hydrogens summed into heavy atoms:
elementType: S Si F F F O O O C C C C C C C
charge: 1.076293 1.418704 -0.120293 -0.116962 -0.109198 -0.721635 -0.467692 -0.503661 -0.168620 -0.033061 -0.016944 -0.014281 -0.279050 -0.281413 0.337812
polarizability: 1.72305178e+02 -5.49712774e+00 1.34479571e+02 2.71694184e+00 -5.98029851e-01 1.30710790e+02
1716.lowfreq: -9.7025 -3.2779 -0.0017 -0.0013 -0.0012 1.9098 22.2791 22.8089 28.6118
frequency: 22.0894 22.6676 28.4782 42.9484 60.2726 101.2234 116.4410 117.2515 128.1607 135.0054 143.0738 171.6241 173.3732 198.9894 201.0369 212.5903 220.0400 239.4826 257.0952 263.1934 275.5374 290.3557 310.3144 337.4514 374.8693 382.6992 384.9032 434.8645 451.2715 461.1827 502.3349 553.9435 629.8807 649.4407 692.9908 717.2883 806.9063 810.8936 829.8623 840.6551 883.5172 913.7659 938.5975 939.8646 950.9513 952.7594 982.7683 1002.7138 1016.2736 1075.8601 1086.9881 1195.7091 1198.8668 1202.7901 1306.9584 1315.5665 1375.2770 1379.7548 1404.2843 1436.4753 1444.6376 1447.6143 1455.2229 1462.6667 1466.0197 1469.6639 1482.8111 1484.6054 1494.0390 2957.6480 2962.4534 2965.2825 2988.1084 2990.6815 3047.0848 3049.1530 3054.6761 3061.6863 3079.6350 3082.6371 3089.2608 3092.3208 3098.7731 3101.6372
redmass: 10.6400 4.4298 6.3271 3.4825 4.9341 2.2273 1.4717 5.0484 4.2014 1.2854 2.6625 4.1999 7.2061 2.5028 2.3574 1.2987 7.2294 4.6182 1.2872 1.7840 1.6576 2.5694 5.7909 4.6076 3.9909 2.5926 3.1347 15.4670 15.9057 17.7298 6.6035 3.5482 12.7051 8.0101 6.4106 2.5005 1.2584 2.7053 1.8688 8.7935 1.4896 1.5015 1.6628 1.6437 1.3233 8.0567 16.5924 1.4141 1.3934 13.1446 13.2503 2.2065 2.6545 2.8439 1.2012 1.1892 1.1787 1.1834 1.1910 1.0500 1.0534 1.0459 1.0503 1.0487 1.0477 1.0470 1.0476 1.0480 1.0526 1.0350 1.0363 1.0367 1.0349 1.0347 1.0986 1.0990 1.0969 1.0998 1.0997 1.0990 1.0975 1.0973 1.0987 1.0986
irintensity: 0.0048 0.3303 0.2823 0.5377 0.5542 1.1926 0.3987 2.4509 1.7843 0.4717 0.4852 2.6555 2.8863 1.3276 0.3874 0.1444 3.4923 1.2662 0.8843 5.2118 0.3346 3.3302 11.1484 24.3996 15.7362 1.9841 9.0835 87.8263 4.7024 0.4756 26.8749 4.2619 100.6274 68.9613 188.7490 11.2757 2.0820 10.3794 31.6835 133.1490 106.7362 94.5672 4.2066 3.3048 7.8725 225.1139 77.9468 9.5988 5.4919 238.9427 199.6285 45.5089 7.0499 0.7063 57.5940 41.5627 15.8107 20.5764 9.8977 1.9706 1.7583 13.3474 23.5476 0.7769 2.7390 0.1775 14.1792 12.2232 23.1814 31.5336 36.1148 45.4346 5.2086 5.1716 6.9371 12.0779 81.1463 32.5891 9.3124 32.2991 4.3169 14.1408 5.9350 5.8489
temp: 298.150 k
press: 1.00000 atm
elementType: 16 14 9 9 9 8 8 8 6 6 6 6 6 6 6 1 1 1 1 1 1 1 1 1 1 1 1 1 1 1
symmnumber: 1
zpe: 568111.0 jmol-1
zpe.correction: 0.216382 hartree
zpe.thermalcorrener: 0.237794 hartree
zpe.thermalcorrenthalpy: 0.238739 hartree
zpe.thermalcorrgfe: 0.164409 hartree
zpe.sumelectzpe: -1487.018267 hartree
zpe.sumelectthermal: -1486.996854 hartree
zpe.sumelectthermalent: -1486.995910 hartree
zpe.sumelectthermalfe: -1487.070239 hartree
dipole: 4.4911 -1.2891 1.7490
dipole: 4.9891
quadrupole: -101.7345 -107.7668 -109.4721
quadrupole: 5.7268 -1.3812 0.6269
quadrupole: 4.5900 -1.4424 -3.1476 5.7268 -1.3812 0.6269
hfenergy: -1487.2346487 hartree
pointgroup: C01 [X(C7H15F3O3S1Si1)]
dipole: -1.8250675 0.0604876 0.7199113 debye
polarizability: 172.8857184|-3.1724611|132.8706222|-2.2224395|1.6967417|131.7391978 unknown
InChI: InChI=1S/C7H15F3O3SSi/c1-6(2,3)15(4,5)13-14(11,12)7(8,9)10/h1-5H3
charge 0 multiplicity 1
30 atoms
S  1.615173 -0.540179 -0.702009
Si -1.509546 -0.768798 -0.048572
F  1.90015 0.324656 1.987008
F  3.869353 0.249561 0.853729
F  2.40262 1.941353 0.465286
O  0.009658 0.159842 -0.430949
O  2.209254 -0.070748 -2.117641
O  1.666763 -2.089516 -0.237859
C  -2.781057 0.69447 -0.124048
C  -4.186486 0.117409 0.21646
C  -2.398068 1.785294 0.912149
C  -2.795048 1.308336 -1.549661
C  -1.732473 -2.080829 -1.402188
C  -1.287105 -1.52978 1.676707
C  2.525918 0.596037 0.773883
H  -4.509252 -0.655554 -0.507026
H  -4.933927 0.934815 0.179791
H  -4.224772 -0.317968 1.233288
H  -1.39733 2.204221 0.704766
H  -2.401818 1.39407 1.947243
H  -3.133265 2.61331 0.866681
H  -1.802222 1.70443 -1.827273
H  -3.521557 2.144588 -1.586249
H  -3.099431 0.570794 -2.316465
H  -1.72132 -1.624385 -2.407462
H  -0.916215 -2.823827 -1.352169
H  -2.689471 -2.620907 -1.280403
H  -0.463119 -2.26512 1.664306
H  -1.046177 -0.75604 2.426692
H  -2.205428 -2.052134 2.002685
