program: Gaussian 09
title: 000123526
version: EM64L-G09RevD.01
frameworkgroup: C1[X(C10H21ClO)]
method: RPBEPBE
basis: SDD
operation: Freq
keyword: #p
keyword: freq=noraman
keyword: PBEPBE/SDD
title: #p freq=noraman PBEPBE/SDD
converged: YES YES NO NO
title: Mulliken charges:
elementType: Cl O C C C C C C C C C C H H H H H H H H H H H H H H H H H H H H H
charge: -0.084403 -0.437976 -0.382849 -0.382390 -0.375475 -0.378739 -0.369044 -0.374880 -0.398337 -0.316996 -0.330220 -0.602983 0.194349 0.195740 0.194082 0.195176 0.196553 0.192494 0.197475 0.197936 0.191161 0.195747 0.195633 0.196086 0.185485 0.218072 0.220689 0.220971 0.216163 0.182516 0.259440 0.259634 0.328890
chargesum: 0.00000
title: Mulliken charges with hydrogens summed into heavy atoms:
elementType: Cl O C C C C C C C C C C
charge: -0.084403 -0.109086 0.007241 0.006868 0.013572 0.016672 0.017864 0.016839 0.005220 0.124664 0.068459 -0.083910
polarizability: 1.70318960e+02 6.95159062e+00 1.04587537e+02 2.38011995e-01 1.29787066e+00 9.48036419e+01
1716.lowfreq: 0.0023 0.0033 0.0034 0.3764 8.0430 22.8697 31.4705 44.6709 58.4677
frequency: 23.8108 31.4950 55.3220 59.7583 85.1971 91.7243 99.2298 127.1464 137.9326 154.6113 156.5685 161.1232 169.9327 255.5263 301.1548 321.7983 369.1265 422.5381 472.8608 501.0773 677.6090 724.1807 729.7175 743.8627 763.8668 792.8398 838.8556 897.6923 942.4050 961.9570 984.4549 993.6813 1015.9321 1028.5454 1035.6552 1064.2872 1068.1098 1071.9602 1078.1324 1080.5853 1090.9351 1109.5214 1190.3357 1202.2517 1219.4325 1232.1237 1249.7954 1258.8138 1274.2794 1280.1396 1285.1334 1289.3273 1291.5594 1300.3458 1301.2400 1311.4066 1330.0028 1344.1540 1353.7678 1357.6574 1360.1963 1382.9727 1457.1677 1461.7504 1462.6731 1465.5001 1466.9189 1469.8630 1475.8205 1482.2526 1487.6906 1490.6589 2945.4128 2951.8854 2953.0352 2955.4549 2956.7537 2959.5135 2964.8280 2968.7694 2986.1478 2992.1614 2996.9262 2999.6118 3010.5204 3024.7466 3036.0435 3044.3775 3046.6214 3059.4030 3073.4901 3129.3180 3556.3173
redmass: 5.7332 6.1855 3.3594 1.9612 5.1046 1.7860 2.7806 1.7860 2.5060 5.6085 1.9632 2.1594 4.7896 3.6536 2.6962 1.4487 3.3478 4.1339 3.1191 3.3053 6.1641 1.0613 1.0763 1.0906 1.1132 1.1614 1.2161 1.2451 4.1682 1.3102 5.1964 5.0656 1.1708 3.8278 4.2547 2.7133 2.6845 1.1193 2.2424 2.1229 1.9427 2.0619 1.7608 1.2178 1.4958 1.2609 1.3564 1.2605 1.2493 1.0467 1.2026 1.0629 1.1504 1.1046 1.1179 1.2748 1.3180 1.3922 1.5166 1.6599 1.5725 1.2573 1.0978 1.0742 1.0754 1.0677 1.0711 1.0827 1.0937 1.0966 1.0987 1.1001 1.0689 1.0588 1.0589 1.0598 1.0595 1.0616 1.0608 1.0592 1.0962 1.0976 1.0595 1.0999 1.1019 1.1022 1.1018 1.1030 1.0564 1.1041 1.0977 1.1114 1.0661
irintensity: 1.3141 0.9605 0.8366 2.0137 0.4007 3.0672 1.7303 0.8261 0.9423 1.0684 0.5875 0.7775 1.0032 5.7760 22.3628 135.0159 11.3963 4.2310 0.3618 6.9870 45.8220 15.1062 0.3149 9.1537 0.3839 3.7283 1.1918 3.9826 64.2082 0.4720 0.2811 34.1701 0.2108 0.6148 7.4104 12.1770 4.0349 1.5954 0.9998 0.7493 18.5208 17.0019 3.5611 25.0206 2.1654 5.4670 1.0123 2.1728 7.9298 1.8288 11.2882 0.3417 1.0122 0.0241 0.2371 2.8844 18.3356 0.4633 1.7098 0.9787 0.6929 25.4622 1.9651 0.2556 0.1700 0.2896 0.2913 0.1461 0.5018 1.0970 0.0396 35.4727 52.7550 0.7903 2.2057 3.0599 1.6431 4.5412 4.5816 231.7237 1.0793 2.5135 26.2797 1.2799 3.5590 3.0846 7.7504 168.4404 30.2665 70.4379 67.6877 28.4928 6.7813
temp: 298.150 k
press: 1.00000 atm
elementType: 17 8 6 6 6 6 6 6 6 6 6 6 1 1 1 1 1 1 1 1 1 1 1 1 1 1 1 1 1 1 1 1 1
symmnumber: 1
zpe: 770630.1 jmol-1
zpe.correction: 0.293517 hartree
zpe.thermalcorrener: 0.309703 hartree
zpe.thermalcorrenthalpy: 0.310648 hartree
zpe.thermalcorrgfe: 0.247086 hartree
zpe.sumelectzpe: -927.922328 hartree
zpe.sumelectthermal: -927.906143 hartree
zpe.sumelectthermalent: -927.905198 hartree
zpe.sumelectthermalfe: -927.968760 hartree
dipole: 0.8524 1.2783 1.3133
dipole: 2.0212
quadrupole: -135.5353 -82.2696 -81.0180
quadrupole: -3.8336 11.0508 1.5080
quadrupole: -35.9277 17.3380 18.5896 -3.8336 11.0508 1.5080
hfenergy: -928.2158459 hartree
pointgroup: C01 [X(C10H21Cl1O1)]
dipole: -0.3275157 -0.4904668 0.5334169 debye
polarizability: 170.1428368|7.7026814|104.6687115|-0.7355818|-1.6358026|94.8985904 unknown
InChI: InChI=1S/C10H21ClO/c11-9-7-5-3-1-2-4-6-8-10-12/h12H,1-10H2
charge 0 multiplicity 1
33 atoms
Cl 7.319643 0.482357 -0.021996
O  -7.050867 -0.257612 -0.020069
C  -0.656539 0.416768 -0.001564
C  0.61671 -0.458724 0.005614
C  -1.962813 -0.408524 0.011289
C  1.92302 0.366171 -0.005033
C  -3.236399 0.467033 0.004287
C  3.195209 -0.512359 -0.000607
C  -4.542348 -0.360745 0.019109
C  4.496041 0.329885 -0.012642
C  -5.801891 0.523954 0.015265
C  5.73633 -0.562778 -0.00689
H  -0.641529 1.093503 0.878421
H  -0.645785 1.072196 -0.897442
H  0.604448 -1.115624 0.90064
H  0.601756 -1.134115 -0.875414
H  -1.978904 -1.084615 -0.868743
H  -1.97368 -1.064307 0.907105
H  1.939852 1.039402 0.877087
H  1.935258 1.023942 -0.898817
H  -3.216704 1.146805 0.882189
H  -3.226393 1.119605 -0.893496
H  3.183193 -1.168326 0.894682
H  3.17763 -1.185234 -0.883141
H  -4.5523 -1.013365 0.918595
H  -4.576632 -1.030729 -0.862089
H  4.518124 0.997287 0.869923
H  4.513302 0.979174 -0.908719
H  -5.843421 1.13642 -0.901718
H  -5.791053 1.21048 0.890776
H  5.810421 -1.178637 0.902937
H  5.80522 -1.197298 -0.904204
H  -7.081801 -0.838689 0.782066
