program: Gaussian 09
title: 000123497
version: EM64L-G09RevD.01
frameworkgroup: C1[X(C8H9NO3)]
method: RPBEPBE
basis: SDD
operation: Freq
keyword: #pfreq=noraman
keyword: PBEPBE/SDD
title: #p freq=noraman PBEPBE/SDD
converged: YES YES NO NO
title: Mulliken charges:
elementType: O O O N C C C C C C C C H H H H H H H H H
charge: -0.478836 -0.217713 -0.205144 0.016988 0.375143 0.421256 0.216387 -0.521108 -0.363610 -0.387874 -0.417332 -0.768631 0.286747 0.239442 0.295022 0.215761 0.215785 0.252129 0.252456 0.212335 0.360796
chargesum: 0.00000
title: Mulliken charges with hydrogens summed into heavy atoms:
elementType: O O O N C C C C C C C C
charge: -0.118040 -0.217713 -0.205144 0.016988 0.375143 0.421256 0.216387 -0.234361 -0.124168 -0.092852 0.014214 -0.051710
polarizability: 1.50109684e+02 -2.78085497e+00 1.22571763e+02 1.44093891e-03 1.25554132e-02 4.98850769e+01
1716.lowfreq: -8.1898 -4.3010 -0.0007 -0.0006 -0.0005 3.3711 16.2612 43.1527 116.2294
frequency: 15.6584 43.1350 116.2223 155.2871 167.4400 230.9469 252.1683 264.8237 311.7236 330.9598 373.6002 396.1020 425.2428 508.9551 520.4541 576.1024 669.9755 673.5994 724.1705 734.2164 758.3616 842.6310 887.3721 917.2441 990.0323 1003.1636 1008.5748 1025.8994 1042.3680 1059.1608 1148.1412 1158.4320 1199.0321 1203.5897 1214.5668 1234.3801 1281.7013 1346.7149 1368.5281 1400.4420 1409.9856 1412.9007 1455.1247 1469.7350 1470.5485 1500.5714 1570.4047 1628.4653 2932.3087 2976.3749 2995.3306 3081.1024 3095.7093 3140.1524 3158.8208 3183.9857 3593.9399
redmass: 9.5308 3.7011 2.9439 3.6821 5.9629 1.0564 1.1630 5.8489 2.9586 6.5211 4.7180 5.9865 3.3038 5.1882 3.4835 4.8776 8.1377 4.3089 4.7814 4.4274 7.6277 1.2705 5.3257 1.3525 1.3733 3.5752 1.8582 1.7167 1.5493 2.8114 1.4116 1.2994 4.1641 1.0636 3.2786 2.0983 1.4888 3.2808 5.1473 1.6216 1.6234 2.4971 1.0459 1.1138 1.1120 3.2614 6.5528 6.9576 1.0550 1.1055 1.0365 1.0960 1.1013 1.0901 1.0913 1.0945 1.0667
irintensity: 0.0007 13.3434 9.8083 10.8210 7.8777 0.3158 154.8662 4.2595 10.6238 1.0274 0.2930 0.7680 1.6932 3.9375 14.8601 16.6337 20.8355 0.4619 8.2133 0.2031 6.4833 37.4167 3.4999 11.2210 0.1273 74.7321 14.8326 2.8558 10.0904 16.7315 63.4997 10.9812 199.0438 0.0345 51.8789 32.3814 13.0994 26.3453 122.1349 2.3827 14.7393 3.5570 12.6786 18.2032 13.3430 48.6387 20.5422 0.7555 41.6445 41.5411 14.5340 8.0479 25.3873 13.7690 3.4359 1.9691 9.3092
temp: 298.150 k
press: 1.00000 atm
elementType: 8 8 8 7 6 6 6 6 6 6 6 6 1 1 1 1 1 1 1 1 1
symmnumber: 1
zpe: 416638.9 jmol-1
zpe.correction: 0.158689 hartree
zpe.thermalcorrener: 0.170125 hartree
zpe.thermalcorrenthalpy: 0.171069 hartree
zpe.thermalcorrgfe: 0.119731 hartree
zpe.sumelectzpe: -589.693949 hartree
zpe.sumelectthermal: -589.682513 hartree
zpe.sumelectthermalent: -589.681569 hartree
zpe.sumelectthermalfe: -589.732907 hartree
dipole: 4.8845 1.2625 0.0148
dipole: 5.0451
quadrupole: -68.0085 -67.6071 -70.9171
quadrupole: -15.6797 0.0788 -0.0279
quadrupole: 0.8357 1.2372 -2.0729 -15.6797 0.0788 -0.0279
hfenergy: -589.8526381 hartree
pointgroup: C01 [X(C8H9N1O3)]
dipole: -1.9003374 0.5552551 -0.1421741 debye
dipolederiv: -0.7689868 0.2291092 -0.0478238 0.3201173 -0.3135115 -0.0539078 -0.0651292 -0.0546987 -0.5844686 -0.4958178 0.0567475 -0.0139396 0.0982978 -0.9089554 0.1443441 -0.0225223 0.1433537 -0.2696551 -0.8953825 -0.0592506 0.0078502 -0.0474492 -0.4671897 0.0534937 0.0049946 0.0538587 -0.2276972 1.4767554 -0.2763109 0.0677275 -0.3172138 1.3233529 -0.2477116 0.0768104 -0.2465687 0.2349467 0.2959243 0.2682489 -0.0530658 -0.155052 0.1435324 -0.0297101 0.0361149 -0.025836 0.0146808 0.1859594 0.2830086 -0.0561385 0.3077126 -0.180682 0.0313152 -0.0601251 0.0314247 -0.0554254 -0.4565572 0.33773 -0.0754175 0.2884544 -0.2232375 0.0575336 -0.0653013 0.0576365 0.0202774 0.0361221 -0.3168202 0.0681958 0.0488255 -0.0677928 -0.012195 -0.0092995 -0.0156463 -0.124917 -0.3496079 -0.1226012 0.0237042 0.0176568 0.1495194 -0.0659263 -0.0053958 -0.0675051 -0.1520194 0.0577481 -0.0105275 0.0036959 -0.1191285 0.1126751 -0.0443198 0.0251638 -0.0428324 -0.0827394 0.6252744 -0.1967981 0.0420826 -0.2943251 0.2470939 0.0322183 0.0612022 0.03251 0.4117899 -0.1628252 -0.2267831 0.0455255 -0.0514057 0.1174192 -0.0188719 0.0091573 -0.021128 0.0335398 0.1428389 -0.0088022 0.0016131 -0.0465733 0.0324607 0.0264593 0.0099134 0.0270775 0.1559971 0.0689814 -0.0390679 0.0073537 -0.0107344 -0.0962164 0.0506175 0.0014571 0.050441 0.1355804 0.0808641 0.0653424 -0.0145286 0.0886269 0.0904535 0.0152786 -0.0196317 0.0148115 0.1553608 -0.0684298 0.0105955 -0.0057955 0.0184317 -0.0995227 -0.10312 -0.0353517 -0.1304888 -0.0284682 -0.0680736 0.010446 0.0013956 0.028747 -0.0041951 0.0933522 0.0255687 0.1203225 -0.1230633 0.0343102 -0.0193982 -0.069634 -0.0051198 0.0699072 0.0384192 -0.0852067 0.0066985 -0.0264062 0.0314702 0.0104067 0.07219 0.0306664 0.0386613 -0.0657079 0.0803926 -0.034139 0.009117 0.0766638 0.1111256 -0.0236032 -0.0187202 -0.1558819 0.0542692 0.003511 0.0555925 0.0928394 0.1527685 -0.1064004 0.0186122 -0.1818142 0.1921093 0.0441695 0.0336772 0.045116 0.4107307 unknown
polarizability: 150.2764604|1.854165|119.3412689|0.6567847|-14.561513|52.9487942 unknown
InChI: InChI=1S/C8H9NO3/c1-6-2-3-7(5-10)4-8(6)9(11)12/h2-4,10H,5H2,1H3
charge 0 multiplicity 1
21 atoms
O  -4.043944 0.149783 0.044693
O  1.804995 -2.32156 0.626951
O  3.175702 -0.548739 0.257531
N  1.997295 -1.069445 0.360724
C  0.920958 1.190448 -0.123746
C  -1.643297 -0.128519 0.124066
C  0.804448 -0.203507 0.167015
C  -0.447731 -0.85166 0.289002
C  -0.3076 1.884729 -0.282034
C  -1.563214 1.254914 -0.164056
C  -2.981453 -0.835946 0.256231
C  2.217856 1.961028 -0.271513
H  -0.44963 -1.922827 0.513927
H  -0.268292 2.956448 -0.50614
H  -2.49171 1.817046 -0.29145
H  -3.042116 -1.654151 -0.494102
H  -3.058642 -1.294291 1.26619
H  2.832564 1.907553 0.643553
H  2.850099 1.54755 -1.076074
H  1.999612 3.019219 -0.495051
H  -4.9272 -0.286873 0.123481
