program: Gaussian 09
title: 000014695
version: EM64L-G09RevD.01
frameworkgroup: C1[X(C17H18O2)]
method: RPBEPBE
basis: SDD
operation: Freq
keyword: #pfreq=noraman
keyword: PBEPBE/SDD
title: #p freq=noraman PBEPBE/SDD
converged: YES YES NO NO
title: Mulliken charges:
elementType: O O C C C C C C C C C C C C C C C C C H H H H H H H H H H H H H H H H H H
charge: -0.418596 -0.236539 -0.407676 -0.575631 -0.118056 0.503613 -0.711930 -0.413187 -0.442828 0.343951 0.162518 -0.401786 -0.398382 0.341582 -0.399421 -0.399498 -0.236010 -0.236176 -0.243626 0.235980 0.214227 0.234012 0.200371 0.238337 0.225969 0.239946 0.224818 0.244590 0.230066 0.235882 0.235570 0.238330 0.237521 0.374950 0.224522 0.224087 0.228501
chargesum: 0.00000
title: Mulliken charges with hydrogens summed into heavy atoms:
elementType: O O C C C C C C C C C C C C C C C C C
charge: -0.043647 -0.236539 0.042531 -0.141248 0.120281 0.503613 -0.021197 -0.168597 -0.212763 0.343951 0.162518 -0.165904 -0.162811 0.341582 -0.161091 -0.161977 -0.011488 -0.012089 -0.015125
polarizability: 3.04888126e+02 3.88031291e+00 1.73944579e+02 2.03910257e+01 7.75528308e+00 1.10146938e+02
1716.lowfreq: -11.7943 -0.0006 -0.0006 0.0002 1.7493 3.9980 16.5738 22.2806 29.0712
frequency: 16.4219 22.2276 29.0081 36.8851 69.1736 85.7881 95.7663 120.3161 152.9620 199.2487 214.8610 243.1111 267.6021 288.6039 312.6884 351.7099 384.9752 404.7169 410.2010 424.1480 475.3256 510.6152 557.8196 567.5195 599.7576 604.5246 614.7847 639.4482 701.4523 708.1766 710.6550 736.0426 744.0407 770.2630 794.6051 814.8258 846.6553 849.6803 850.8789 917.0926 921.4920 957.2347 972.0667 972.3716 973.8716 988.2792 991.9828 996.2642 1008.8721 1019.2165 1037.0934 1040.6896 1058.7787 1080.6896 1084.1030 1114.3082 1134.1655 1172.7152 1181.7276 1189.3076 1200.2821 1224.2698 1246.2636 1260.2303 1279.0550 1290.1711 1298.7932 1304.7312 1319.7133 1340.5871 1359.5665 1366.8412 1374.4483 1387.6677 1412.3541 1438.6279 1456.0715 1473.9861 1476.8123 1478.9516 1483.2863 1517.4995 1567.9500 1588.5835 1612.7962 1622.9593 1657.9476 2980.2453 2988.0653 2994.4026 3007.7371 3033.1425 3063.0770 3088.3066 3098.1289 3113.5854 3117.1812 3121.3137 3125.9568 3138.8567 3139.5604 3146.3060 3147.8090 3163.9624 3508.6975
redmass: 4.0263 5.7840 7.9005 5.2480 3.7018 4.8691 4.3741 3.1805 3.3777 2.6982 1.3135 3.5145 2.5128 4.5901 3.3399 4.3453 3.4096 2.8437 2.8776 4.0845 3.7451 3.3655 2.8684 3.5393 3.6511 1.3094 6.3721 6.7061 1.7257 4.5359 3.9239 2.7890 2.1297 1.9747 1.6700 3.3623 1.5797 1.2615 1.4004 1.4544 1.6639 1.3883 1.5660 1.4181 1.4152 4.9712 1.3144 6.6493 4.0029 2.7364 2.7398 1.8943 1.6440 2.9220 1.6169 1.4334 1.4102 1.0528 1.4752 1.1106 1.1442 2.3086 1.5609 1.3240 1.2313 3.0088 1.4063 1.4567 1.2952 1.4368 1.6714 2.6350 8.9741 1.2343 3.5509 2.3940 1.0856 1.0501 2.1673 1.0959 1.0672 2.9135 5.8914 6.5156 6.0522 6.4021 8.1829 1.0593 1.0354 1.0603 1.0834 1.0993 1.1039 1.1004 1.1007 1.0874 1.0876 1.0844 1.0875 1.0929 1.0944 1.0961 1.0962 1.1016 1.0639
irintensity: 0.0481 0.4308 1.4106 0.3301 0.0165 0.6612 0.5534 0.3572 0.1743 0.0993 0.1896 0.7127 1.6579 0.6096 1.9137 1.8574 0.3828 0.3612 0.0126 6.5682 25.3073 17.0017 5.7464 13.6059 3.3172 121.7470 0.1578 0.3126 47.2002 1.9265 36.3883 24.8815 13.2053 64.3451 0.2602 5.6949 20.4662 0.1123 13.1840 1.9756 0.5124 1.7525 13.1021 0.0882 1.2655 0.4262 0.0829 11.2842 0.4575 0.3527 371.7066 1.5221 7.8015 15.1045 6.7930 0.4374 8.6019 0.0177 8.6331 1.2506 0.6139 0.1888 10.5435 6.4638 5.4475 0.2443 4.3659 3.7695 0.2729 2.7047 17.3115 2.1264 0.0271 16.4540 4.4223 3.9289 4.8253 13.3716 61.8127 8.1856 17.1879 12.0132 0.8105 1.6644 13.7499 1.5616 190.1898 23.2558 19.7597 34.1997 15.0472 3.7028 22.8482 31.3899 29.7043 15.1864 26.8171 2.8761 1.9623 16.1552 19.4266 1.1942 49.7202 27.2649 22.3907
temp: 298.150 k
press: 1.00000 atm
elementType: 8 8 6 6 6 6 6 6 6 6 6 6 6 6 6 6 6 6 6 1 1 1 1 1 1 1 1 1 1 1 1 1 1 1 1 1 1
symmnumber: 1
zpe: 795855.1 jmol-1
zpe.correction: 0.303125 hartree
zpe.thermalcorrener: 0.320919 hartree
zpe.thermalcorrenthalpy: 0.321863 hartree
zpe.thermalcorrgfe: 0.253938 hartree
zpe.sumelectzpe: -807.709233 hartree
zpe.sumelectthermal: -807.691440 hartree
zpe.sumelectthermalent: -807.690495 hartree
zpe.sumelectthermalfe: -807.758421 hartree
dipole: -1.3010 -1.3374 -0.1259
dipole: 1.8701
quadrupole: -94.2363 -104.9898 -116.3037
quadrupole: 1.5954 2.9297 -0.5820
quadrupole: 10.9403 0.1868 -11.1271 1.5954 2.9297 -0.5820
hfenergy: -808.0123584 hartree
pointgroup: C01 [X(C17H18O2)]
dipole: -0.5125841 -0.4426765 -0.2874123 debye
polarizability: 303.8959333|-8.1219305|155.3933665|23.6406466|29.6539259|129.6903426 unknown
InChI: InChI=1S/C17H18O2/c1-13(17(18)19)7-8-14-9-11-16(12-10-14)15-5-3-2-4-6-15/h2-6,9-13,18H,7-8H2,1H3
charge 0 multiplicity 1
37 atoms
O  -6.483608 0.903945 -0.422976
O  -4.728998 1.493727 0.973498
C  -3.134471 -0.726274 -0.041277
C  -2.357784 0.230195 -0.988409
C  -4.666655 -0.681608 -0.237694
C  -0.857134 0.182379 -0.745989
C  -5.385669 -1.795761 0.578463
C  -0.280852 0.871149 0.353359
C  0.006237 -0.571985 -1.579924
C  1.971624 0.049539 -0.226044
C  -5.235623 0.669563 0.1796
C  1.103212 0.806899 0.608585
C  1.392498 -0.63847 -1.326988
C  3.437447 -0.01496 0.04125
C  4.130792 1.095895 0.597951
C  4.184944 -1.189531 -0.252162
C  5.517509 1.035033 0.852534
C  5.572238 -1.251412 -0.00113
C  6.24717 -0.139144 0.553693
H  -2.898232 -0.467665 1.008068
H  -2.787936 -1.764708 -0.206566
H  -2.728379 1.260525 -0.826851
H  -2.58139 -0.04064 -2.038996
H  -4.918061 -0.824265 -1.306758
H  -5.17194 -1.689742 1.657374
H  -6.478342 -1.758044 0.429735
H  -5.022251 -2.786218 0.252196
H  -0.927626 1.460464 1.015381
H  -0.409682 -1.101743 -2.446207
H  1.513514 1.328422 1.480945
H  2.037457 -1.201379 -2.011631
H  3.58527 2.02381 0.804181
H  3.669466 -2.070647 -0.651056
H  -6.843338 1.775051 -0.100572
H  6.030722 1.906636 1.274461
H  6.124755 -2.170262 -0.228281
H  7.324013 -0.18667 0.75014
