program: Gaussian 09
title: 000123475
version: EM64L-G09RevD.01
frameworkgroup: C1[X(C4H7NOS)]
method: RPBEPBE
basis: SDD
operation: Freq
keyword: #p
keyword: freq=noraman
keyword: PBEPBE/SDD
title: #p freq=noraman PBEPBE/SDD
converged: NO NO NO NO
title: Mulliken charges:
elementType: S O N C C C C H H H H H H H
charge: 0.098875 -0.269179 0.254448 -0.220929 -0.392623 -0.494604 -0.514373 0.204744 0.201296 0.254773 0.225927 0.202190 0.241145 0.208311
chargesum: 0.00000
title: Mulliken charges with hydrogens summed into heavy atoms:
elementType: S O N C C C C
charge: 0.098875 -0.269179 0.254448 0.185111 0.088077 0.157041 -0.514373
polarizability: 1.04028811e+02 2.10053425e+01 6.23418783e+01 -1.51348705e+00 -1.80273502e-01 4.22883421e+01
1716.lowfreq: 0.0014 0.0019 0.0026 3.1227 10.0808 11.3614 23.0833 46.7014 79.5023
frequency: 20.8584 46.6242 79.4358 138.3088 218.0193 254.5891 323.3339 396.3214 402.2082 502.4568 612.8221 793.8365 937.6200 977.1637 1067.2090 1091.0200 1118.0594 1133.1503 1160.0048 1210.2059 1275.6235 1349.8463 1372.2100 1439.3928 1452.5938 1460.6444 1465.2089 1482.4888 2215.1768 2920.1735 2932.2728 2972.9299 2985.3760 3005.7077 3034.3391 3111.2577
redmass: 6.3931 3.2204 3.4719 2.7659 1.3825 2.1696 3.1398 12.2886 11.1458 2.9455 4.5127 2.6524 2.2129 2.9166 2.3177 3.1798 1.4669 3.5854 1.4584 1.1539 1.1180 1.2969 1.3071 1.1408 1.0852 1.0511 1.0635 1.0743 12.2411 1.0524 1.0384 1.0790 1.0836 1.1029 1.1019 1.0973
irintensity: 0.2109 6.4532 4.8993 2.1153 4.8989 7.7259 2.1801 0.1597 0.6307 15.2743 22.9540 8.8136 5.1695 23.1687 39.8664 57.6357 7.4156 4.0646 10.5030 2.6871 2.8263 49.8043 14.1354 0.6017 27.3447 15.2199 17.5428 5.9034 906.1553 50.8289 99.3456 14.4881 114.9987 63.4592 19.2256 24.4984
temp: 298.150 k
press: 1.00000 atm
elementType: 16 8 7 6 6 6 6 1 1 1 1 1 1 1
symmnumber: 1
zpe: 280874.1 jmol-1
zpe.correction: 0.106979 hartree
zpe.thermalcorrener: 0.115752 hartree
zpe.thermalcorrenthalpy: 0.116696 hartree
zpe.thermalcorrgfe: 0.070848 hartree
zpe.sumelectzpe: -684.074173 hartree
zpe.sumelectthermal: -684.065400 hartree
zpe.sumelectthermalent: -684.064456 hartree
zpe.sumelectthermalfe: -684.110304 hartree
dipole: 4.8708 2.0057 1.3201
dipole: 5.4305
quadrupole: -51.3272 -44.4298 -49.6511
quadrupole: -1.9711 2.8956 -0.4904
quadrupole: -2.8578 4.0396 -1.1818 -1.9711 2.8956 -0.4904
hfenergy: -684.181152 hartree
pointgroup: C01 [X(C4H7N1O1S1)]
dipole: -1.6927852 -1.29884 0.1102018 debye
dipolederiv: -0.6514224 -0.3955376 -0.1464105 -0.4803433 -0.4785884 -0.1318378 -0.1983147 -0.1458224 -0.1751205 -0.8703091 0.2220604 0.0018852 0.4075179 -0.6527285 -0.0381412 -0.0068715 0.0176599 -0.4263836 -1.3658214 -0.8814418 -0.2997095 -1.0124551 -0.9976255 -0.3031079 -0.3284362 -0.3059326 -0.2935006 0.4200877 -0.1008951 0.1071686 -0.2870831 0.5719012 -0.0651733 0.17433 -0.1396646 0.3479338 0.6971168 0.3917663 0.1407057 0.4546314 0.606018 0.1043782 0.1799377 0.0919412 0.3263421 0.6878566 -0.11421 -0.0280245 -0.1082436 0.325175 0.0847406 -0.1659393 0.1344025 0.326973 1.3674333 1.0971078 0.4198503 1.2411188 0.9824881 0.3780332 0.4829778 0.3882322 0.1273866 0.0437881 0.0339301 -0.0178352 0.0646811 0.0036296 -0.0524699 -0.0527737 0.0428193 -0.2000616 -0.1277778 -0.1786596 -0.0350532 -0.0376762 -0.181342 -0.0007399 -0.0541395 -0.0219427 0.0514367 0.0016174 -0.0919952 -0.0371286 -0.106248 0.0543666 0.0034814 -0.0601131 -0.0745532 -0.0973484 -0.0467166 0.0044999 -0.0425386 -0.0677255 -0.1709232 0.0054449 -0.0352794 0.0767667 0.0945886 -0.183698 -0.0642434 0.0015253 -0.1852984 -0.0660488 -0.0319233 0.0332254 -0.0524099 0.0653583 0.0398496 0.0558858 -0.0078053 0.1057022 -0.0597328 0.0871232 -0.0296362 0.0995821 0.0515851 -0.0120045 0.0217324 -0.0566299 0.0114218 0.0634109 -0.0398082 0.0610327 -0.1110784 -0.1991893 unknown
polarizability: 91.383173|26.3838359|71.7216072|10.9528973|9.5313631|45.5542514 unknown
InChI: InChI=1S/C4H7NOS/c1-6-3-2-5-4-7/h2-3H2,1H3
charge 0 multiplicity 1
14 atoms
S  3.065044 1.473992 0.621238
O  -1.842538 0.243396 -0.493169
N  1.034892 -0.373566 -0.109408
C  -1.352308 -0.967293 0.151513
C  0.012913 -1.299636 -0.475055
C  -3.083058 0.73757 0.09973
C  1.898243 0.408346 0.198949
H  -1.249531 -0.824665 1.24957
H  -2.042304 -1.822125 -0.032495
H  -0.103407 -1.305867 -1.576236
H  0.312255 -2.31999 -0.161082
H  -3.908311 0.000363 -0.001437
H  -3.342504 1.653233 -0.453391
H  -2.949686 0.982941 1.174572
