program: Gaussian 09
title: 000123474
version: EM64L-G09RevD.01
frameworkgroup: C1[X(C8H10N2O)]
method: RPBEPBE
basis: SDD
operation: Freq
keyword: #p
keyword: freq=noraman
keyword: PBEPBE/SDD
title: #p freq=noraman PBEPBE/SDD
converged: YES YES NO NO
title: Mulliken charges:
elementType: O N N C C C C C C C C H H H H H H H H H H
charge: -0.237369 -0.379324 -0.315714 0.445206 0.449885 -0.406782 -0.337410 -0.341533 -0.415403 -0.808748 -0.031562 0.231415 0.221167 0.225850 0.226836 0.229151 0.222177 0.226887 0.306540 0.321117 0.167612
chargesum: 0.00000
title: Mulliken charges with hydrogens summed into heavy atoms:
elementType: O N N C C C C C C C C
charge: -0.237369 -0.072783 0.005403 0.445206 0.449885 -0.180932 -0.110573 -0.110117 -0.194236 -0.130533 0.136051
polarizability: 1.48630111e+02 2.79851024e+00 9.79267163e+01 6.16469012e+00 5.59299447e+00 6.66223601e+01
1716.lowfreq: -16.3787 -5.7455 -0.0004 0.0003 0.0005 6.5834 26.1601 30.8707 49.2008
frequency: 25.9882 30.8472 49.0981 124.5610 163.6619 225.5049 293.5907 306.7886 364.1408 402.4633 407.3862 445.8604 515.6350 560.4471 584.4449 634.6318 712.2129 755.1970 793.4920 814.6353 824.6243 849.8508 934.1184 956.0736 958.1569 981.0553 1003.6528 1011.2149 1046.6184 1125.8093 1186.5314 1212.0363 1223.3371 1291.4158 1306.9401 1360.8214 1367.4228 1396.8817 1414.8379 1435.3018 1470.2343 1472.6132 1495.8688 1510.2821 1597.1849 1630.4249 1650.1371 2935.4009 2972.1056 3048.3319 3079.9213 3112.4316 3122.3950 3136.6397 3156.4631 3499.3898 3508.6398
redmass: 1.0488 6.9638 4.4514 3.9577 3.2593 2.8234 2.9059 2.9613 3.2392 4.5457 2.9273 2.2237 2.5934 1.2146 3.2243 6.8775 2.9395 3.9520 6.0592 1.5775 1.2726 4.7358 1.3197 1.5730 1.3810 1.5486 2.6507 3.0041 1.5242 1.2781 1.1280 2.7503 2.8631 2.9603 1.4109 1.4154 2.9244 1.2342 3.6070 1.5085 1.0461 1.1321 1.3250 2.8050 5.0015 6.4686 5.8071 1.0873 1.0372 1.0978 1.0983 1.0867 1.0887 1.0967 1.0947 1.0786 1.0772
irintensity: 0.4950 4.9239 3.3732 2.6079 21.5062 12.0317 20.0922 2.4486 17.2073 9.4838 0.1773 80.4317 14.5910 111.1315 96.8556 0.3809 0.2882 7.8495 5.9888 64.6251 7.4782 15.9947 1.5876 3.8470 0.7378 12.0977 0.4928 42.5703 10.7581 18.3555 9.6717 34.2082 0.2821 20.5281 7.9146 5.5189 11.8746 7.7930 1.3065 73.1364 13.1014 11.6935 16.3968 160.5092 12.8263 103.3810 199.0114 117.9099 49.6538 24.9372 20.6243 14.4390 22.4464 24.5916 10.5950 7.7055 38.2206
temp: 298.150 k
press: 1.00000 atm
elementType: 8 7 7 6 6 6 6 6 6 6 6 1 1 1 1 1 1 1 1 1 1
symmnumber: 1
zpe: 439602.2 jmol-1
zpe.correction: 0.167436 hartree
zpe.thermalcorrener: 0.178396 hartree
zpe.thermalcorrenthalpy: 0.179340 hartree
zpe.thermalcorrgfe: 0.128695 hartree
zpe.sumelectzpe: -494.743559 hartree
zpe.sumelectthermal: -494.732599 hartree
zpe.sumelectthermalent: -494.731655 hartree
zpe.sumelectthermalfe: -494.782300 hartree
dipole: 0.2395 -0.7597 -3.0227
dipole: 3.1259
quadrupole: -59.4343 -56.6947 -71.8864
quadrupole: 4.1103 13.2917 2.1311
quadrupole: 3.2375 5.9771 -9.2146 4.1103 13.2917 2.1311
hfenergy: -494.9109945 hartree
pointgroup: C01 [X(C8H10N2O1)]
dipole: -0.1214682 0.4507801 -1.1377634 debye
dipolederiv: -0.5055887 -0.0454942 -0.046786 0.2404247 -0.4895076 0.3693616 -0.4907531 0.1188221 -0.872706 -0.9323828 0.0487172 0.1231692 0.2203723 -0.0297617 -0.0819812 0.5384193 -0.1819079 -0.5176284 -0.5754487 0.2260946 -0.2653608 0.4541395 -0.1097926 -0.1137622 -0.5819633 -0.06623 -0.4488134 0.2216322 -0.0640359 -0.0721327 -0.0225466 -0.209386 -0.0017708 -0.0639471 0.001061 -0.0447553 1.3748921 -0.1439811 -0.2475747 -0.346613 -0.057142 0.0237813 -0.2981872 0.0657394 0.1881014 0.0420704 0.1043883 -0.0388055 -0.089286 0.1451129 0.0275126 -0.056716 -0.0027835 -0.1406732 0.0403978 -0.0503015 -0.0546967 0.0988814 0.1550833 -0.0127828 -0.0428421 0.0281063 -0.1423039 -0.2900905 -0.0235488 0.0098557 0.3436618 -0.0164617 -0.041497 0.0284899 0.0361089 -0.2023435 -0.3948596 0.0970549 0.0136121 -0.2027622 0.0833111 0.0716939 0.033863 -0.0137364 -0.1940479 -0.0829465 0.0151019 0.0388445 -0.0558569 0.0885778 0.00956 0.0353636 -0.0005243 0.0753396 0.8774994 0.1794716 0.4382445 -0.0576435 0.4947598 -0.3595093 0.9424055 -0.2608992 1.2446663 0.0198785 -0.103931 0.0393702 -0.1148406 -0.0129618 -0.0043529 0.0238223 0.0044066 0.1499335 0.0442057 0.0947199 0.0356459 0.0782413 -0.0806501 -0.0325207 0.0312019 -0.0305025 0.1501438 0.0459303 0.0805298 0.0228867 0.0818512 -0.0947052 -0.0278005 0.0282841 -0.0307714 0.1401849 -0.0124534 -0.1148889 0.0230595 -0.1101659 -0.0343818 0.0137692 0.027918 0.0175547 0.1415287 -0.0083484 0.0034199 0.0545162 -0.0252728 0.0523156 0.109503 0.1265841 0.0747581 -0.0838188 0.0583711 -0.006076 0.0102871 0.1118977 -0.1445885 -0.0354925 0.0163544 -0.0113656 0.1023604 -0.1020838 -0.0209605 -0.062434 -0.0538341 0.0669206 -0.081202 -0.1312643 -0.0606436 -0.0155195 0.0741295 -0.0296695 -0.0117826 -0.1149814 0.1386832 0.0395354 -0.1469298 0.1345776 0.2884227 0.2159851 -0.0911277 -0.0120601 -0.231973 0.153657 0.0399046 -0.0784358 0.0624095 0.148471 -0.1107897 -0.1554831 0.0021412 -0.2036939 -0.0990824 0.0880503 0.0583326 0.1158205 0.0334575 unknown
polarizability: 148.2923896|4.0409168|98.9167306|-7.3844745|-1.4837022|65.9700675 unknown
InChI: InChI=1S/C8H10N2O/c1-7-2-4-8(5-3-7)10-9-6-11/h2-6,9-10H,1H3
charge 0 multiplicity 1
21 atoms
O  3.392009 -0.18575 1.338528
N  1.55985 -0.57979 -0.829016
N  2.525357 0.437015 -0.75147
C  -2.538315 0.153235 0.207919
C  0.21397 -0.304815 -0.442314
C  -1.628322 1.227358 0.05808
C  -2.033859 -1.162624 0.024182
C  -0.268496 1.013795 -0.26218
C  -0.684507 -1.396302 -0.2997
C  -3.998196 0.389413 0.557301
C  3.396878 0.559821 0.325634
H  0.414519 1.8645 -0.351174
H  -0.32393 -2.422784 -0.441909
H  -1.983581 2.255403 0.200416
H  -2.710361 -2.019085 0.137225
H  -4.271267 -0.101678 1.510656
H  -4.217188 1.466162 0.662312
H  -4.67309 -0.015016 -0.221015
H  1.929668 -1.497398 -0.5617
H  2.664503 1.000823 -1.594517
H  4.122958 1.389217 0.160142
