program: Gaussian 09
title: 000123464
version: EM64L-G09RevD.01
frameworkgroup: C1[X(C8H6ClFO2)]
method: RPBEPBE
basis: SDD
operation: Freq
keyword: #p
keyword: freq=noraman
keyword: PBEPBE/SDD
title: #p freq=noraman PBEPBE/SDD
converged: YES YES NO NO
title: Mulliken charges:
elementType: Cl F O O C C C C C C C C H H H H H H
charge: -0.046076 -0.196683 -0.412737 -0.213648 0.401005 -0.627053 -0.239220 0.208698 -0.241067 -0.374584 -0.184018 0.210810 0.280253 0.288969 0.260082 0.262038 0.241781 0.381449
chargesum: 0.00000
title: Mulliken charges with hydrogens summed into heavy atoms:
elementType: Cl F O O C C C C C C C C
charge: -0.046076 -0.196683 -0.031288 -0.213648 0.401005 -0.057830 -0.239220 0.208698 0.019015 -0.112545 0.057763 0.210810
polarizability: 1.21105109e+02 7.51714608e+00 1.05918741e+02 -1.39586938e+01 1.82698771e+00 6.13006863e+01
1716.lowfreq: -4.5366 -0.0014 0.0014 0.0022 4.3891 8.0906 25.7554 37.2086 73.3368
frequency: 25.6831 37.2034 73.3223 124.4454 216.3491 227.7008 278.6064 296.2794 336.2539 390.8533 462.2224 486.9029 504.7739 528.4985 549.1413 577.4798 635.2000 647.5515 719.2431 780.0391 813.5230 839.1166 864.5838 884.3287 944.9285 965.9433 1046.5711 1059.6091 1118.1114 1165.7937 1188.7283 1227.1579 1233.4418 1259.4056 1341.7437 1382.3159 1434.2700 1436.2155 1459.9086 1580.8546 1617.4278 1677.8372 3024.6954 3083.0023 3155.8576 3178.1805 3188.9567 3519.2026
redmass: 7.2795 12.7952 7.3319 11.6925 4.9744 8.3945 3.5349 6.6393 7.0587 7.4867 3.1666 2.7688 4.1520 5.0960 5.2192 4.6311 1.4453 4.9200 3.3302 1.5251 5.4324 5.5560 4.3878 1.3847 2.5191 1.3198 2.6391 1.8876 3.3636 1.1386 1.7912 1.8396 1.5166 1.8199 1.9037 7.8921 1.9599 1.2457 3.7011 7.0067 9.0166 8.5881 1.0604 1.0996 1.0878 1.0932 1.0994 1.0641
irintensity: 0.0733 0.8295 3.3900 0.2260 0.5824 1.4232 2.3564 1.0811 2.5404 10.8736 20.2091 10.1728 13.7903 21.5524 0.2605 19.7494 129.4847 5.6985 9.3549 73.4804 50.4636 16.8383 1.6692 0.3089 55.2599 1.1884 292.6557 31.2900 19.6878 0.8126 24.5827 5.0144 8.2815 4.4497 67.1008 0.8811 63.1450 41.5686 28.8561 57.2311 28.4332 188.2215 5.4595 0.3442 4.8754 1.7683 3.6767 28.2231
temp: 298.150 k
press: 1.00000 atm
elementType: 17 9 8 8 6 6 6 6 6 6 6 6 1 1 1 1 1 1
symmnumber: 1
zpe: 320536.2 jmol-1
zpe.correction: 0.122086 hartree
zpe.thermalcorrener: 0.133063 hartree
zpe.thermalcorrenthalpy: 0.134007 hartree
zpe.thermalcorrgfe: 0.083158 hartree
zpe.sumelectzpe: -1017.942640 hartree
zpe.sumelectthermal: -1017.931663 hartree
zpe.sumelectthermalent: -1017.930719 hartree
zpe.sumelectthermalfe: -1017.981568 hartree
dipole: -1.1950 0.1903 -0.7746
dipole: 1.4368
quadrupole: -57.8338 -77.7787 -79.9800
quadrupole: -0.6336 -1.7564 0.5775
quadrupole: 14.0304 -5.9146 -8.1158 -0.6336 -1.7564 0.5775
hfenergy: -1018.0647259 hartree
pointgroup: C01 [X(C8H6Cl1F1O2)]
dipole: -0.4751824 0.0338258 -0.3042696 debye
dipolederiv: -0.2679018 -0.2525532 0.0467589 -0.2408433 -0.6068325 0.0609318 0.0532467 0.0663386 -0.0730975 -0.3772097 0.3097996 0.0772264 0.2582342 -0.8871165 -0.1262913 0.0852626 -0.1300263 -0.1716346 -1.3470892 -0.0193943 0.3563467 -0.0611912 -0.4106233 0.0210429 0.1864481 0.0202341 -0.3374523 -0.6928703 -0.0023613 -0.020725 -0.0204027 -0.2724744 0.0062788 0.1573844 0.0334105 -0.9167133 0.1023445 -0.1375966 0.0028909 0.025325 -0.4052584 -0.0170328 0.0081765 0.0247339 -0.0620809 -0.0875337 -0.0297122 -0.0884574 -0.0635618 0.0889982 -0.0387917 -0.2783861 -0.0118536 -0.1803622 0.3761603 0.4143139 -0.1154138 0.3145608 0.922468 -0.0721092 -0.1007009 -0.087813 -0.0136048 0.4261688 -0.2660577 -0.1147362 -0.2580559 0.9874609 0.1329188 -0.0997121 0.1129817 0.1375876 -0.227777 -0.1733832 0.0208779 -0.1589693 -0.2047268 0.0493455 0.0203795 0.0552136 -0.1190261 -0.1836656 0.1695519 0.0111936 0.015794 -0.1069873 -0.0091939 0.0027472 -0.0586674 -0.1585822 0.0797734 -0.039871 -0.0793943 0.0689747 0.1545036 -0.0066069 -0.0706853 0.0243792 -0.1128743 1.7078192 0.048096 -0.1470999 0.1141356 0.2081008 -0.0087691 -0.0294059 -0.0452398 1.2310551 0.0361123 -0.0150321 0.0024385 -0.0379424 0.0569085 0.090779 0.0164095 0.0395505 0.08105 0.0623702 0.0141034 -0.0131834 0.0630676 0.0316099 -0.0641897 0.0105743 -0.0265118 0.1031948 0.0768665 0.0407082 0.0276937 0.0570823 -0.0055723 -0.0234948 0.0340914 -0.0212717 0.1607242 0.0788071 -0.0513074 0.0281131 -0.056776 -0.006588 0.0088518 0.0334698 0.0090066 0.1752283 -0.0651882 -0.007079 0.0697539 -0.00598 0.0780888 -0.0013921 0.0719344 -0.0004649 0.140117 0.3028134 -0.0022249 -0.0642834 -0.0134516 0.3780409 -0.002277 -0.1012342 -0.0040002 0.1164715 unknown
polarizability: 119.8171461|8.333755|107.1527093|-14.3392331|-0.0424352|61.3546807 unknown
InChI: InChI=1S/C8H6ClFO2/c9-6-2-1-3-7(10)5(6)4-8(11)12/h1-3,11H,4H2
charge 0 multiplicity 1
18 atoms
Cl 0.054021 2.737227 -0.351662
F  -0.231747 -2.46213 -0.481679
O  3.602743 0.079645 -0.184904
O  2.034059 -0.042855 1.525405
C  -0.128737 -0.051613 -0.42036
C  1.314034 -0.106238 -0.861908
C  -0.824012 1.150254 -0.148978
C  -0.878351 -1.233435 -0.228251
C  -2.165945 1.185304 0.275676
C  -2.215865 -1.265685 0.193024
C  -2.859492 -0.034427 0.445743
C  2.293156 -0.018975 0.30689
H  1.552827 0.715882 -1.558695
H  1.523749 -1.051769 -1.392582
H  -2.655409 2.142583 0.471956
H  -2.725763 -2.224119 0.319701
H  -3.901973 -0.022076 0.777892
H  4.238204 0.119828 0.580331
