program: Gaussian 09
title: 000123473
version: EM64L-G09RevD.01
frameworkgroup: C1[X(C18H21N)]
method: RPBEPBE
basis: SDD
operation: Freq
keyword: #pfreq=noraman
keyword: PBEPBE/SDD
title: #p freq=noraman PBEPBE/SDD
converged: YES YES NO NO
title: Mulliken charges:
elementType: N C C C C C C C C C C C C C C C C C C H H H H H H H H H H H H H H H H H H H H H
charge: -0.074781 -0.355576 -0.564408 -0.340326 0.512533 -0.389876 -0.426490 -0.695015 0.234404 -0.380453 -0.348856 0.442138 0.442079 -0.388130 -0.369726 -0.378732 -0.422962 -0.345890 -0.807059 0.204665 0.204873 0.202978 0.203765 0.194361 0.195143 0.232145 0.230510 0.211416 0.211355 0.216009 0.249072 0.236108 0.213435 0.224994 0.273946 0.231072 0.230285 0.233231 0.232944 0.224819
chargesum: 0.00000
title: Mulliken charges with hydrogens summed into heavy atoms:
elementType: N C C C C C C C C C C C C C C C C C C
charge: -0.074781 0.053962 -0.157665 0.049178 0.512533 -0.157731 -0.195981 -0.056235 0.234404 -0.131381 -0.112747 0.442138 0.442079 -0.174695 -0.144732 -0.104786 -0.191891 -0.115604 -0.116065
polarizability: 4.30737615e+02 1.67121977e+01 1.73786722e+02 -1.54341147e+01 1.82536801e+01 1.23841706e+02
1716.lowfreq: -9.7221 -4.4749 -0.0012 -0.0002 0.0012 7.7334 12.9057 23.7648 37.7059
frequency: 12.4306 23.7338 37.6529 40.5725 45.0071 62.4838 68.6576 104.3060 112.1325 149.7153 188.2790 200.9689 222.7118 229.1590 287.8912 318.3709 327.9202 354.1763 364.2036 409.1938 411.6808 428.5468 472.0472 490.7600 518.6306 550.2020 601.3294 633.0042 638.3989 723.3870 732.8686 734.3927 753.2161 787.2755 789.3930 821.9639 829.1196 832.0097 842.2710 858.3536 866.3998 899.6701 917.6672 949.9333 953.8331 968.9444 984.2272 985.7840 997.1795 1003.3947 1010.3311 1010.8950 1046.3285 1065.0902 1068.0176 1104.6292 1117.6167 1122.7347 1163.4172 1182.2154 1195.4077 1205.5762 1217.2181 1221.3057 1251.7687 1253.4671 1270.2517 1283.6605 1299.9042 1307.3098 1319.5966 1344.1893 1347.9061 1369.4691 1388.6028 1388.8239 1397.6717 1413.3475 1414.4352 1465.7457 1468.1690 1470.3477 1473.4287 1476.6946 1481.1237 1488.9125 1491.4378 1509.4480 1563.0355 1569.0376 1591.8764 1622.0435 1625.3942 2939.5985 2961.4764 2967.6388 2972.6233 2975.4807 2977.2214 3000.8821 3019.1529 3044.7736 3052.9514 3069.6404 3071.4050 3085.1101 3112.9989 3113.2757 3118.5943 3121.5756 3138.1406 3139.7409 3159.2522 3160.3987
redmass: 3.6370 4.2503 1.2871 2.1331 2.8704 3.1643 2.2316 2.4387 3.8685 4.2568 5.1145 3.0389 2.6241 1.2840 3.7810 2.7028 3.4064 3.2901 3.1512 2.8864 2.8800 3.6686 4.1395 5.3103 2.8854 2.7468 4.3979 6.8991 6.8376 3.1896 1.0950 3.1317 4.1397 1.7447 2.0522 1.5834 1.4115 3.7290 1.6512 1.2908 3.5567 1.7598 1.2377 1.3714 1.3652 1.3695 1.5632 1.4179 1.3862 3.0718 3.4545 2.8209 1.5707 1.3736 2.5410 2.1918 1.3413 1.2582 1.9442 1.1242 1.5695 1.5033 2.3110 2.8230 2.0722 1.4170 1.2407 1.0710 1.3608 1.3638 1.4318 1.5712 2.1889 4.2346 1.2483 2.0119 1.3562 3.5416 3.3867 1.0745 1.0459 1.0787 1.1126 1.0423 1.0740 1.0941 2.5228 2.9368 6.7025 6.4582 6.0246 6.3722 6.6121 1.0856 1.0585 1.0591 1.0370 1.0373 1.0590 1.0988 1.1020 1.1046 1.0973 1.1008 1.0994 1.0987 1.0874 1.0872 1.0890 1.0893 1.0961 1.0961 1.0953 1.0951
irintensity: 0.2360 0.2201 0.6296 0.7062 0.2507 0.1185 0.2334 0.1420 0.1769 0.6002 0.1296 12.4743 0.0896 0.1473 3.4629 0.6506 4.4400 1.5061 2.7527 1.5609 2.9010 7.0232 6.6817 0.9139 12.6455 33.5076 5.9850 0.2387 0.2709 2.9185 7.6890 3.7666 6.1676 0.3805 2.9181 13.4234 37.7147 5.0226 29.4037 5.2966 24.9596 8.7883 0.6917 0.5486 2.0771 1.2457 14.5385 6.8653 5.6922 2.0713 2.7453 9.6069 13.3880 2.5823 4.6702 30.6114 18.8609 9.9925 20.9451 25.8799 6.7135 0.8991 0.8424 0.6783 4.7876 3.8566 0.6425 0.8434 2.4800 13.6373 1.5858 0.6689 3.4457 0.7742 9.9212 3.9217 8.1919 7.8119 2.4708 0.2018 13.2483 0.5089 13.6654 12.6256 3.0541 15.2890 37.6514 54.8519 22.6331 36.2560 45.3258 46.3962 8.3440 58.0114 16.5834 1.4089 42.4462 44.0554 108.0286 3.1701 1.1124 41.7185 19.7677 84.8879 61.9584 21.1688 21.2407 9.0104 32.3036 22.2600 16.6234 33.8661 7.5319 6.0256
temp: 298.150 k
press: 1.00000 atm
elementType: 7 6 6 6 6 6 6 6 6 6 6 6 6 6 6 6 6 6 6 1 1 1 1 1 1 1 1 1 1 1 1 1 1 1 1 1 1 1 1 1
symmnumber: 1
zpe: 884131.6 jmol-1
zpe.correction: 0.336748 hartree
zpe.thermalcorrener: 0.355833 hartree
zpe.thermalcorrenthalpy: 0.356778 hartree
zpe.thermalcorrgfe: 0.285416 hartree
zpe.sumelectzpe: -751.889542 hartree
zpe.sumelectthermal: -751.870457 hartree
zpe.sumelectthermalent: -751.869513 hartree
zpe.sumelectthermalfe: -751.940874 hartree
dipole: 0.4978 1.3296 0.0560
dipole: 1.4208
quadrupole: -87.4386 -108.2065 -117.2147
quadrupole: 2.4578 -1.8816 5.3199
quadrupole: 16.8480 -3.9199 -12.9281 2.4578 -1.8816 5.3199
hfenergy: -752.2262901 hartree
pointgroup: C01 [X(C18H21N1)]
dipole: -0.2003164 0.436073 -0.2866838 debye
polarizability: 431.3178311|-18.2584896|144.2391962|-3.0034068|-30.8180156|152.8090154 unknown
InChI: InChI=1S/C18H21N/c1-3-4-5-16-10-12-18(13-11-16)19-14-17-8-6-15(2)7-9-17/h6-14H,3-5H2,1-2H3
charge 0 multiplicity 1
40 atoms
N  -0.889465 -0.501076 0.253708
C  5.546712 0.655478 0.150052
C  4.87991 -0.638778 -0.396554
C  7.086745 0.634466 0.027029
C  3.365786 -0.620164 -0.260314
C  2.74051 -0.98081 0.963899
C  2.533031 -0.221875 -1.338194
C  7.748258 1.9171 0.575899
C  0.5145 -0.503256 0.037919
C  1.341369 -0.940272 1.109274
C  1.131514 -0.157925 -1.199762
C  -3.135988 0.339705 -0.18052
C  -5.986986 0.321524 0.094899
C  -1.673311 0.370247 -0.335215
C  -3.934123 1.326471 -0.818242
C  -3.782667 -0.661356 0.59974
C  -5.338452 1.3155 -0.681167
C  -5.18108 -0.665399 0.732234
C  -7.497025 0.301356 0.247308
H  5.260651 0.790094 1.212934
H  5.140386 1.531736 -0.394385
H  5.301147 -1.506387 0.149884
H  5.165598 -0.761398 -1.459877
H  7.483661 -0.249261 0.567723
H  7.366829 0.498455 -1.037784
H  3.3606 -1.312845 1.806039
H  2.991241 0.029085 -2.303237
H  7.509001 2.05935 1.646698
H  7.390611 2.811563 0.031827
H  8.848815 1.879055 0.477524
H  0.857653 -1.237125 2.045491
H  0.510235 0.117023 -2.060555
H  -1.273127 1.195341 -0.964164
H  -3.449914 2.104802 -1.422155
H  -3.158771 -1.417474 1.087265
H  -5.93949 2.085137 -1.17989
H  -5.666691 -1.441545 1.336978
H  -7.926007 -0.642553 -0.139275
H  -7.793744 0.378365 1.310462
H  -7.971719 1.135444 -0.297093
