program: Gaussian 09
title: 000014716
version: EM64L-G09RevD.01
frameworkgroup: C1[X(C20H27O4P)]
method: RPBEPBE
basis: SDD
operation: Freq
keyword: #p
keyword: freq=noraman
keyword: PBEPBE/SDD
title: #p freq=noraman PBEPBE/SDD
converged: YES YES NO NO
title: Mulliken charges:
elementType: P O O O O C C C C C C C C C C C C C C C C C C C C H H H H H H H H H H H H H H H H H H H H H H H H H H H
charge: 1.342394 -0.483230 -0.544619 -0.532066 -0.588555 -0.008388 -0.429553 -0.409223 -0.361969 -0.331102 -0.354999 -0.726237 -0.696323 0.373777 0.367605 -0.340772 -0.330913 -0.377608 -0.374983 -0.202450 -0.204603 -0.196198 -0.192931 -0.247272 -0.248211 0.219057 0.200067 0.187891 0.207327 0.234791 0.191962 0.204078 0.234226 0.231864 0.194632 0.195418 0.231660 0.216031 0.221554 0.210536 0.211169 0.217041 0.297670 0.288197 0.254973 0.258234 0.231492 0.231887 0.231957 0.231839 0.231246 0.231630
chargesum: 0.00000
title: Mulliken charges with hydrogens summed into heavy atoms:
elementType: P O O O O C C C C C C C C C C C C C C C C C C C C
charge: 1.342394 -0.483230 -0.544619 -0.532066 -0.588555 0.210669 -0.041596 0.032896 0.034070 0.134988 0.035051 -0.056991 -0.057577 0.373777 0.367605 -0.043102 -0.042716 -0.122634 -0.116749 0.029042 0.027284 0.035759 0.038908 -0.016026 -0.016581
polarizability: 2.26559876e+02 6.94363135e+00 3.25387694e+02 3.27860627e+01 -4.30009653e-01 2.06467681e+02
1716.lowfreq: -5.6864 -3.0976 -0.0009 -0.0007 0.0004 5.9546 11.1926 15.9754 20.4659
frequency: 11.0781 15.9528 20.3673 22.3286 27.7887 31.1648 46.9886 57.1229 62.1396 75.1610 85.7209 113.5400 127.6288 140.7146 146.9506 164.0367 179.5876 195.3555 216.9547 226.0573 230.4184 238.9945 242.3807 269.1196 284.5712 290.2412 308.8357 371.5265 382.4013 409.4717 410.3105 443.8343 446.3406 479.4122 492.3417 496.8489 513.7345 527.9410 554.0068 605.2204 607.8937 638.6571 682.1957 691.4310 692.3426 729.2486 730.7957 760.7245 760.9742 762.5466 774.1571 806.2234 831.0800 837.0211 837.2500 845.7526 887.7986 909.8196 913.7883 914.9558 917.8611 965.5609 971.2520 971.5602 972.4841 985.4544 985.7304 990.4616 990.6227 991.3476 1021.9584 1022.5048 1024.9485 1038.2642 1057.4529 1077.2763 1079.3026 1081.5707 1092.3463 1126.4829 1151.5225 1155.6701 1162.6755 1166.0910 1170.2016 1176.2246 1187.3831 1194.3256 1200.8264 1212.0295 1250.6623 1267.3343 1280.2460 1289.6863 1296.9130 1313.8886 1316.1287 1327.7274 1344.6837 1354.0824 1357.7325 1370.3598 1380.8314 1381.4540 1391.0349 1398.1096 1441.1131 1442.1910 1461.5922 1467.9532 1470.4070 1472.5236 1474.5844 1476.3256 1477.2599 1481.1056 1485.2580 1490.9285 1491.3588 1592.7174 1595.7348 1603.1376 1604.2024 2956.1573 2960.8325 2969.8656 2971.5983 2973.1456 2979.3168 2994.4420 2996.8878 3000.7651 3010.3860 3037.6029 3041.9752 3064.1560 3069.5821 3072.4056 3072.6644 3074.7616 3133.1399 3133.1929 3142.1913 3143.1604 3154.1869 3158.0187 3165.3994 3166.5303 3174.9708 3175.8460
redmass: 4.8758 5.5711 3.4126 3.7999 3.7675 4.3383 4.8606 2.9721 4.6516 1.6280 4.1598 4.0576 2.6360 5.4144 1.6786 6.3389 3.4028 5.1386 4.8821 1.1937 4.0497 2.6411 2.2589 2.3720 6.3978 6.0319 2.3713 5.3257 7.0782 2.9541 2.9583 6.5150 4.0888 4.5805 3.2466 3.0364 4.6189 2.2003 7.4463 6.6931 6.6356 8.6628 8.3164 2.3624 2.3135 3.3261 1.3998 1.4520 1.5057 1.5215 1.5569 1.3604 8.5760 1.2430 1.2956 6.1477 1.9454 2.3003 1.3955 1.4042 1.9998 1.7003 1.3786 1.4017 2.1147 6.0366 5.9887 1.3362 1.3247 1.7182 2.1656 2.1094 1.4074 2.6387 9.0978 2.4231 1.5391 1.6280 2.0365 1.7621 2.2208 2.6696 2.2515 1.2443 1.1278 1.4965 1.1974 1.6742 1.2245 1.3935 1.2494 1.2210 1.1420 1.0682 1.2454 1.3187 1.3181 1.4591 1.4911 1.4070 1.4660 1.3742 8.8564 8.9378 1.2161 1.2213 2.2649 2.2701 1.0761 1.0731 2.1512 1.4532 1.3609 1.0609 1.0471 1.0975 1.0682 1.0616 1.0760 6.2133 6.2806 6.5652 6.4641 1.0589 1.0593 1.0614 1.0792 1.0362 1.0374 1.0774 1.0607 1.0785 1.1003 1.1038 1.0994 1.1078 1.1007 1.0994 1.0992 1.1001 1.0851 1.0851 1.0893 1.0895 1.0941 1.0933 1.0970 1.0965 1.1011 1.1002
irintensity: 0.1743 0.5969 0.0108 0.0965 0.0755 0.6499 0.1129 0.1626 0.8449 0.0396 0.1082 0.7950 0.7570 5.4165 1.2178 0.2067 4.1208 2.8275 0.3416 0.4523 7.2645 2.1761 1.2105 0.4914 15.1293 10.4556 0.2500 6.0772 31.4135 1.0201 0.8194 71.6841 34.2941 0.4875 17.3882 18.2168 10.4033 4.0054 6.6405 0.9603 19.6539 4.3568 124.4951 21.3764 29.1973 94.9412 25.9037 4.0181 2.3933 227.3560 7.8318 7.1455 608.1980 0.0651 2.1349 46.7041 47.2943 73.3022 1.5946 5.8897 142.3096 1.2106 0.1544 0.5457 7.3938 2.2855 0.9545 1.9212 6.5598 22.7471 51.4120 3.2583 2.6623 0.2671 112.0284 2.5132 5.6533 7.0806 12.7573 2.4564 0.5032 443.3954 0.8955 4.0442 44.7124 15.7925 51.9989 12.6098 0.6915 0.8391 5.4466 0.6095 3.1981 0.9755 0.3603 1.3803 0.6977 0.2534 3.2319 0.0454 0.1833 1.0879 4.7609 0.4206 11.7791 13.9824 12.0694 10.1765 1.0926 0.9573 251.0050 8.8822 9.3894 1.0968 15.3741 22.8392 17.4164 12.7959 8.3064 93.9495 18.7045 58.8152 6.3137 7.6030 0.4069 69.8666 12.9735 41.4444 19.7668 20.0070 15.9612 37.0471 5.9246 56.6469 4.0669 40.6578 94.8007 46.9091 49.7515 61.0823 0.4587 0.1980 13.0075 15.2007 9.3081 17.6734 20.5247 9.2155 14.7277 9.6982
temp: 298.150 k
press: 1.00000 atm
elementType: 15 8 8 8 8 6 6 6 6 6 6 6 6 6 6 6 6 6 6 6 6 6 6 6 6 1 1 1 1 1 1 1 1 1 1 1 1 1 1 1 1 1 1 1 1 1 1 1 1 1 1 1
symmnumber: 1
zpe: 1120680.1 jmol-1
zpe.correction: 0.426845 hartree
zpe.thermalcorrener: 0.454018 hartree
zpe.thermalcorrenthalpy: 0.454962 hartree
zpe.thermalcorrgfe: 0.363437 hartree
zpe.sumelectzpe: -1418.542004 hartree
zpe.sumelectthermal: -1418.514830 hartree
zpe.sumelectthermalent: -1418.513886 hartree
zpe.sumelectthermalfe: -1418.605411 hartree
dipole: 3.3813 0.1160 1.4365
dipole: 3.6756
quadrupole: -162.4640 -132.5614 -158.1116
quadrupole: 1.4993 3.9419 -0.2085
quadrupole: -11.4184 18.4843 -7.0659 1.4993 3.9419 -0.2085
hfenergy: -1418.9688484 hartree
pointgroup: C01 [X(C20H27O4P1)]
dipole: -0.2084283 1.2640458 0.6707823 debye
polarizability: 325.1971796|7.6787771|221.3443593|-6.3158939|33.5214311|211.8737117 unknown
InChI: InChI=1S/C20H27O4P/c1-3-5-12-18(4-2)17-22-25(21,23-19-13-8-6-9-14-19)24-20-15-10-7-11-16-20/h6-11,13-16,18H,3-5,12,17H2,1-2H3
charge 0 multiplicity 1
52 atoms
P  0.080688 -1.539658 -0.627764
O  -0.199071 0.109713 -1.01035
O  1.352316 -1.550381 0.547673
O  -1.116351 -1.972177 0.551021
O  0.231886 -2.429946 -1.927543
C  -0.338444 2.502307 -0.549463
C  -0.762404 3.555187 0.515021
C  1.05242 2.765847 -1.192021
C  -0.838371 5.001001 -0.02569
C  -0.430165 1.107832 0.087691
C  -1.400828 5.998896 1.012614
C  2.243936 2.814271 -0.208461
C  -1.464524 7.446441 0.479437
C  2.744291 -1.576837 0.22139
C  -2.486876 -2.208376 0.219578
C  3.259257 -2.191619 -0.941658
C  -2.916616 -2.635114 -1.056769
C  3.587903 -0.989447 1.188354
C  -3.391092 -2.034442 1.289043
C  4.660444 -2.19914 -1.131033
C  -4.295697 -2.874759 -1.255842
C  4.984756 -1.017988 0.985118
C  -4.762684 -2.289941 1.072256
C  5.525953 -1.618044 -0.176269
C  -5.220755 -2.70588 -0.200367
H  -1.088777 2.530663 -1.36743
H  -0.06535 3.524462 1.377845
H  -1.760609 3.276268 0.914015
H  1.003629 3.720231 -1.75065
H  1.233657 1.975877 -1.94453
H  -1.475366 5.021278 -0.934722
H  0.168196 5.340441 -0.341662
H  -1.435665 0.924693 0.510058
H  0.330052 0.957467 0.876991
H  -2.41473 5.671509 1.321243
H  -0.772621 5.966973 1.92645
H  2.376603 1.856931 0.328949
H  2.129233 3.616161 0.544346
H  3.183728 3.006676 -0.757165
H  -0.458772 7.808643 0.194052
H  -2.109864 7.510638 -0.417001
H  -1.870518 8.140307 1.23822
H  2.589306 -2.650085 -1.675583
H  -2.197507 -2.786008 -1.868839
H  3.145727 -0.536161 2.080681
H  -3.010958 -1.715093 2.263913
H  5.072073 -2.670124 -2.030341
H  -4.641373 -3.203455 -2.241919
H  5.646374 -0.56875 1.733728
H  -5.470529 -2.161601 1.898382
H  6.609575 -1.635106 -0.33292
H  -6.285686 -2.900081 -0.365379
