program: Gaussian 09
title: 000123427
version: EM64L-G09RevD.01
frameworkgroup: C1[X(C8H6Br2O2)]
method: RPBEPBE
basis: SDD
operation: Freq
keyword: #p
keyword: freq=noraman
keyword: PBEPBE/SDD
title: #p freq=noraman PBEPBE/SDD
converged: NO YES NO NO
title: Mulliken charges:
elementType: Br Br O O C C C C C C C C H H H H H H
charge: 0.044685 0.044624 -0.282790 -0.185986 0.612747 -0.335296 -0.335174 -0.195545 -0.195565 -0.228443 0.266881 -0.743045 0.256745 0.256745 0.244644 0.261947 0.250847 0.261980
chargesum: 0.00000
title: Mulliken charges with hydrogens summed into heavy atoms:
elementType: Br Br O O C C C C C C C C
charge: 0.044685 0.044624 -0.282790 -0.185986 0.612747 -0.335296 -0.335174 0.061200 0.061180 0.016200 0.266881 0.031729
polarizability: 1.59491632e+02 -8.17864041e-03 1.40207282e+02 6.95532139e-03 -1.03545634e+01 6.35041760e+01
1716.lowfreq: -6.2917 -6.0524 -1.5009 0.0003 0.0004 0.0006 21.7268 53.3876 55.1841
frequency: 21.5937 53.3874 55.1725 98.8155 104.0404 128.0374 179.0994 232.2645 234.7665 284.1332 311.5347 351.0202 490.2388 506.0747 506.7761 531.6613 553.6656 639.0061 698.7439 708.7607 768.3643 778.5178 858.8693 898.6709 972.5426 984.0177 1023.5171 1041.6299 1063.3134 1153.0656 1153.6585 1200.2074 1209.9608 1357.9980 1383.6675 1414.3006 1417.1553 1451.1067 1452.3263 1563.1525 1572.9130 1698.4112 3009.8406 3097.2769 3148.2601 3153.7813 3173.9518 3185.1888
redmass: 12.3396 8.4497 2.3784 1.2110 11.3329 14.0976 4.5747 10.3893 9.9151 6.0672 7.7408 4.1118 5.3231 5.2276 4.4524 5.2690 3.7148 5.1557 8.7873 4.9840 1.8537 2.8129 7.4272 1.3559 1.3362 2.2425 7.6428 1.6411 2.3260 1.4586 2.9980 1.3661 2.7876 11.4930 1.2384 3.1359 2.1705 1.0467 1.0557 7.2644 7.6642 10.5639 1.0368 1.0972 1.1013 1.0873 1.0929 1.0995
irintensity: 0.0385 1.0477 4.2892 0.1581 3.0062 1.8565 0.0205 3.1255 1.6575 3.2163 3.4066 2.3375 1.4852 0.0023 1.8428 11.6122 5.0557 6.2328 81.5388 12.9816 88.0888 4.3580 87.8398 0.0021 1.5512 90.9388 9.1632 6.1842 18.4231 8.9187 400.6692 7.7781 9.3577 0.8274 72.1932 63.8484 58.0619 16.5079 25.7763 46.8111 5.1127 171.8630 0.5109 3.6268 8.2445 3.0851 1.2881 6.5253
temp: 298.150 k
press: 1.00000 atm
elementType: 35 35 8 8 6 6 6 6 6 6 6 6 1 1 1 1 1 1
symmnumber: 1
zpe: 310278.2 jmol-1
zpe.correction: 0.118179 hartree
zpe.thermalcorrener: 0.130537 hartree
zpe.thermalcorrenthalpy: 0.131481 hartree
zpe.thermalcorrgfe: 0.075847 hartree
zpe.sumelectzpe: -484.945523 hartree
zpe.sumelectthermal: -484.933164 hartree
zpe.sumelectthermalent: -484.932220 hartree
zpe.sumelectthermalfe: -484.987855 hartree
dipole: -0.0017 -0.9628 -1.1193
dipole: 1.4764
quadrupole: -85.7439 -67.4796 -96.2100
quadrupole: -0.0140 0.0044 -5.9115
quadrupole: -2.5994 15.6649 -13.0655 -0.0140 0.0044 -5.9115
hfenergy: -485.0637013 hartree
pointgroup: C01[X(C8H6Br2O2)]
dipole: -0.3797798 0.0009635 -0.4395088 debye
dipolederiv: -0.1403267 0.2649899 0.0426947 0.2141592 -0.5254831 -0.0579003 0.0289342 -0.0625258 -0.0107004 -0.1405615 -0.2651476 0.0425677 -0.2142396 -0.5254155 0.0576069 0.0288234 0.0622272 -0.0106541 -1.774786 -0.0003599 -0.3548644 -0.0002589 -0.2383864 -0.0000266 -0.3542144 -0.0001302 -0.6048648 -0.5763742 -0.0002046 0.1456398 -0.0002881 -0.2466133 0.0001174 -0.3524852 0.0003166 -0.9327089 0.8782926 0.0000306 0.090838 -0.0001084 -0.3467654 -0.0001708 -0.2451869 -0.0001874 0.0695608 0.132576 -0.4371993 -0.1261242 -0.4071258 0.9190805 0.1262502 -0.0420785 0.0894746 -0.084784 0.1329126 0.4373633 -0.1259069 0.4073316 0.918862 -0.1256492 -0.0418955 -0.0888318 -0.0848831 -0.144794 0.1489376 0.0089312 0.1634549 -0.2268407 -0.0541304 0.0057187 -0.0350916 -0.0854858 -0.1449118 -0.1489216 0.0088638 -0.1634904 -0.2267737 0.0540375 0.005674 0.034969 -0.0854379 0.0459962 0.0000044 -0.0461398 0.0000431 0.1180155 0.0000744 -0.044775 0.0000781 -0.1329937 1.8388988 0.0008823 0.1534574 0.0013797 0.2010902 -0.0003932 0.835779 -0.0003858 1.436686 -0.3534812 -0.0007221 0.1361521 -0.0020598 0.0210279 0.0008988 0.2011414 0.0003867 -0.1210585 0.0669278 -0.0497863 0.0139295 -0.0636221 -0.0107172 0.0118716 0.0206763 0.0105615 0.1599759 0.0669633 0.0497442 0.0139526 0.0635858 -0.0107342 -0.0119603 0.0207029 -0.0106493 0.1599673 -0.0780543 0.0000061 0.0505052 0.0000051 0.0501069 -0.0000345 0.0525969 -0.0000305 0.1554556 0.1056707 -0.0300763 0.0007409 0.0219634 0.0039764 -0.0944439 -0.0097289 -0.0785564 0.0809313 -0.020498 0.0003692 -0.056375 0.0008166 0.1230975 0.0003477 -0.100073 0.0005516 0.0083806 0.1055498 0.0300901 0.0011374 -0.0215464 0.0024724 0.0935046 -0.0096095 0.0778235 0.0826137 unknown
polarizability: 140.160041|0.019677|159.4916141|-10.5280127|0.0250548|63.5514344 unknown
InChI: InChI=1S/C8H6Br2O2/c1-5(11)12-8-6(9)3-2-4-7(8)10/h2-4H,1H3
charge 0 multiplicity 1
18 atoms
Br 0.110066 -2.90963 -0.327284
Br 0.110868 2.908156 -0.325703
O  1.227478 -0.000829 -0.650147
O  1.943382 -0.000671 1.58867
C  -0.132687 -0.000741 -0.2684
C  -0.839356 -1.217841 -0.116832
C  -0.839011 1.216486 -0.116205
C  -2.216731 -1.227889 0.180007
C  -2.216384 1.226789 0.180639
C  -2.899656 -0.000493 0.328011
C  2.229165 -0.00068 0.382926
C  3.589601 0.000762 -0.2636
H  -2.743844 -2.178661 0.293885
H  -2.743235 2.177649 0.294987
H  -3.969373 -0.000398 0.558544
H  3.695625 -0.884988 -0.913502
H  4.369885 -0.003243 0.510106
H  3.697206 0.892523 -0.905102
