program: Gaussian 09
title: 000123413
version: EM64L-G09RevD.01
frameworkgroup: C1[X(C7H14O)]
method: RPBEPBE
basis: SDD
operation: Freq
keyword: #pfreq=noraman
keyword: PBEPBE/SDD
title: #p freq=noraman PBEPBE/SDD
converged: YES YES NO NO
title: Mulliken charges:
elementType: O C C C C C C C H H H H H H H H H H H H H H
charge: -0.186205 -0.061259 -0.054828 -0.421051 -0.728835 -0.710293 -0.118301 -0.692562 0.220967 0.198865 0.207936 0.200820 0.223879 0.220527 0.219300 0.237901 0.215010 0.209613 0.160492 0.218308 0.216876 0.222841
chargesum: 0.00000
title: Mulliken charges with hydrogens summed into heavy atoms:
elementType: O C C C C C C C
charge: -0.186205 0.159708 0.144036 -0.012295 -0.065130 -0.047769 0.042191 -0.034538
polarizability: 8.25416804e+01 8.92026156e-01 7.92239000e+01 -1.38319732e+00 -1.57718996e+00 6.97831593e+01
1716.lowfreq: -10.3228 0.0003 0.0008 0.0008 3.3750 19.3636 61.1751 72.0292 87.8419
frequency: 61.0626 70.8552 87.7031 171.6074 210.9961 221.8439 249.6275 272.9128 287.7116 318.3034 382.5546 424.1525 500.4367 521.7034 756.6853 790.8385 894.1276 910.8041 921.8524 947.7281 957.7234 1010.9241 1042.4880 1069.7282 1100.3810 1146.6152 1158.8097 1180.1355 1242.8805 1248.2765 1278.9901 1321.6323 1330.1458 1344.2135 1384.9493 1392.8448 1396.6945 1403.5896 1465.8541 1469.6917 1474.2434 1478.5400 1482.1669 1487.8740 1488.7558 1638.5162 2838.3969 2959.3294 2972.8732 2975.5066 2976.8676 2979.3934 2997.2665 3027.2053 3069.2647 3069.9795 3072.3677 3076.3541 3077.6473 3079.2844
redmass: 4.4060 2.1858 2.7644 2.7474 1.2712 1.1061 1.2375 1.8150 1.8297 2.3975 2.7576 2.6304 2.3496 3.6881 1.3400 2.2687 1.7923 1.6169 1.3714 1.7718 1.4136 1.8871 2.0091 1.5846 2.4123 2.3304 2.0572 2.0834 1.3178 1.2616 1.2386 1.4404 1.4271 1.3938 1.2104 1.2049 1.2171 1.2087 1.0633 1.0497 1.0531 1.0438 1.0591 1.0441 1.0539 7.7361 1.0837 1.0833 1.0557 1.0392 1.0360 1.0378 1.0841 1.1000 1.1000 1.0997 1.0998 1.0990 1.0996 1.0991
irintensity: 5.1301 0.5826 2.0585 0.8181 0.9078 0.1994 0.8547 1.8268 0.8004 0.5651 4.8561 0.1204 8.2535 1.2030 18.6355 0.7034 1.6610 3.6009 2.7712 8.0692 0.2072 5.5715 0.9040 10.2872 1.8529 13.2229 20.9727 10.2959 0.6085 9.4338 2.2383 0.4045 1.2879 2.3879 25.0109 10.3298 0.6990 17.4035 1.2135 4.3325 4.1892 13.3227 7.6159 19.2579 8.3662 134.3555 102.9353 23.2441 30.1464 23.5982 37.6910 21.1806 17.1989 19.3006 19.2511 46.6793 33.7580 39.8128 64.5126 49.7222
temp: 298.150 k
press: 1.00000 atm
elementType: 8 6 6 6 6 6 6 6 1 1 1 1 1 1 1 1 1 1 1 1 1 1
symmnumber: 1
zpe: 509441.1 jmol-1
zpe.correction: 0.194036 hartree
zpe.thermalcorrener: 0.204466 hartree
zpe.thermalcorrenthalpy: 0.205411 hartree
zpe.thermalcorrgfe: 0.158482 hartree
zpe.sumelectzpe: -349.684562 hartree
zpe.sumelectthermal: -349.674131 hartree
zpe.sumelectthermalent: -349.673187 hartree
zpe.sumelectthermalfe: -349.720116 hartree
dipole: -0.3033 -3.2661 0.0434
dipole: 3.2804
quadrupole: -49.3830 -60.2520 -49.7426
quadrupole: -0.2565 -0.2315 -0.0470
quadrupole: 3.7429 -7.1261 3.3832 -0.2565 -0.2315 -0.0470
hfenergy: -349.8785976 hartree
pointgroup: C01 [X(C7H14O1)]
dipole: 0.0498863 -1.2878341 -0.0683487 debye
dipolederiv: -0.286526 0.0010595 0.0199753 0.0303283 -0.9238218 -0.0582237 0.0322163 0.0093218 -0.4176118 -0.1392582 0.1431982 0.1061952 0.0910724 -0.2322888 -0.1038865 0.093448 -0.1921792 -0.087828 0.2917147 -0.1400518 -0.0701251 -0.066756 0.1512259 -0.0013705 0.0079214 -0.0292982 0.140439 0.0461797 0.0189171 0.0195929 0.0351989 0.1242155 0.0203845 0.021779 -0.0274939 0.131032 -0.0134526 0.0069314 -0.0284468 0.0333243 0.0546175 0.0806014 -0.0221969 0.0517582 -0.066091 -0.0522191 -0.0534739 0.0289495 -0.0347648 -0.0116344 0.0404614 0.0227381 0.0502187 0.0287372 0.0574549 -0.0382889 -0.1268588 -0.072382 1.0706948 0.0367864 -0.2106815 0.1689727 0.7429872 -0.0645574 0.011298 -0.0140002 -0.0071502 0.0557914 0.0044992 -0.0081025 0.0131917 0.0842327 0.047891 0.0010685 -0.04121 0.0122296 -0.0110439 0.0696331 -0.0372091 0.0528274 -0.1144326 0.0080096 0.0130231 -0.0000045 0.0064497 -0.1304467 -0.1145334 -0.0189612 -0.1017862 -0.0606036 0.0136472 0.059981 0.0456567 0.0410734 -0.09085 -0.1005968 0.0388355 -0.121618 -0.0016641 0.0325831 0.0125473 -0.0509472 0.0051999 0.0425608 0.0558125 -0.0391843 0.1101438 -0.1443452 0.0906074 0.0011022 -0.0038127 -0.0223395 -0.0707202 -0.1331813 -0.0187625 -0.0777908 -0.0153924 0.0114027 -0.1342294 0.0880277 -0.1103161 -0.0313934 0.0760683 0.0709892 0.0720114 0.0149547 -0.156176 0.1186559 -0.024941 0.0949192 0.0523173 0.0033021 0.0154346 -0.0143266 0.0806365 0.1066185 0.0165083 0.0185477 -0.027936 -0.0538622 -0.0718274 -0.003616 -0.1158674 0.0061413 0.0735516 0.0107718 -0.0876933 -0.007365 0.0549286 0.0659287 -0.0353556 0.0773759 -0.1436745 -0.1881482 0.0562918 0.0267694 0.0896777 0.0543454 -0.0002737 0.0010491 0.0113379 0.0964197 0.0809553 -0.030742 0.0685693 -0.0413199 -0.0512618 0.1335067 0.088987 0.0746693 -0.2253552 -0.0835038 -0.1213352 0.0091891 -0.1587122 -0.0599498 0.026491 0.0180668 0.0334909 0.0957138 0.0621909 0.0069862 0.0079367 0.0362573 0.0615469 0.0821354 -0.0586108 0.0737519 -0.1348592 0.0610348 0.0397809 0.00863 0.0733111 -0.0549711 -0.1117172 0.0412152 -0.1187114 -0.0094367 unknown
polarizability: 82.286879|1.3818368|79.6991232|-0.873872|-1.0574047|69.5627374 unknown
InChI: InChI=1S/C7H14O/c1-4-7(5-8)6(2)3/h5-7H,4H2,1-3H3
charge 0 multiplicity 1
22 atoms
O  -0.31648 2.246532 0.485601
C  -0.212596 -0.085277 -0.323551
C  1.28269 -0.589122 -0.295359
C  -1.231558 -1.231594 -0.088496
C  1.752485 -1.053129 1.107117
C  2.242754 0.478385 -0.869881
C  -0.412472 1.015368 0.70943
C  -2.693215 -0.801193 -0.342874
H  -0.383431 0.361082 -1.324132
H  1.30527 -1.472472 -0.968725
H  -0.971649 -2.076971 -0.755737
H  -1.134565 -1.612222 0.948461
H  1.828359 -0.201948 1.809462
H  1.074224 -1.805428 1.548865
H  2.756513 -1.510091 1.037045
H  2.226489 1.401841 -0.262739
H  1.96424 0.754955 -1.903418
H  3.281001 0.097766 -0.884601
H  -0.64425 0.646287 1.745376
H  -3.390697 -1.643366 -0.183431
H  -2.825451 -0.441432 -1.380259
H  -2.99836 0.019429 0.333546
