program: Gaussian 09
title: 000123357
version: EM64L-G09RevD.01
frameworkgroup: C1[X(C12H8)]
method: RPBEPBE
basis: SDD
operation: Freq
keyword: #p
keyword: freq=noraman
keyword: PBEPBE/SDD
title: #p freq=noraman PBEPBE/SDD
converged: YES YES NO NO
title: Mulliken charges:
elementType: C C C C C C C C C C C C H H H H H H H H
charge: 0.197870 0.386810 0.176733 -0.371936 -0.439959 -0.425554 -0.403523 -0.230736 -0.239441 -0.241941 0.129441 -0.489243 0.252677 0.240042 0.237546 0.250709 0.231192 0.229434 0.229362 0.280519
chargesum: 0.00000
title: Mulliken charges with hydrogens summed into heavy atoms:
elementType: C C C C C C C C C C C C
charge: 0.197870 0.386810 0.176733 -0.119260 -0.199918 -0.188009 -0.152813 0.000456 -0.010007 -0.012580 0.129441 -0.208724
polarizability: 1.81755857e+02 7.52667002e+00 1.62467492e+02 1.84485743e-02 1.51523211e-02 4.86501566e+01
1716.lowfreq: -0.0006 -0.0002 0.0006 9.1933 9.6839 16.5921 106.0051 126.9489 177.1615
frequency: 106.0020 126.9484 177.1614 202.9914 338.1187 360.1276 433.6570 445.3981 473.4620 480.7440 534.8516 570.2218 580.5946 607.4870 650.7916 651.7014 685.1248 750.0674 786.3900 791.2842 823.9725 851.7038 889.0389 925.4358 969.1663 989.5064 997.9445 1014.6808 1032.8675 1075.6889 1147.8062 1171.9130 1181.4834 1234.0428 1240.1737 1275.4068 1360.7579 1400.3413 1417.7674 1437.8354 1451.6650 1513.2293 1582.7677 1587.7633 1628.8695 2123.1999 3123.0166 3127.1421 3134.8956 3146.7315 3149.5871 3164.7374 3167.0518 3428.9956
redmass: 3.9866 4.2606 4.0899 3.8261 4.8850 4.0660 7.1172 3.2770 3.2400 6.1417 6.8478 6.9877 3.5292 1.2767 1.2288 3.1367 5.9552 1.3184 5.4382 1.7314 1.6147 4.9508 1.7809 1.4305 1.3742 1.3708 1.3466 4.2215 2.4627 2.2206 1.4197 1.1022 1.2316 1.6684 2.1896 1.8200 2.7706 2.5162 5.8594 2.5203 2.4785 3.8778 6.2819 5.9686 6.5208 6.2805 1.0862 1.0871 1.0885 1.0920 1.0946 1.1005 1.0987 1.1549
irintensity: 0.3594 0.5814 3.6484 3.0117 3.5270 0.7261 0.8334 7.4585 0.5782 0.7950 0.4179 1.4769 1.5026 76.7731 61.3813 4.0181 2.9301 2.1260 0.5232 85.5283 63.7197 1.3939 6.2129 0.0170 1.7825 2.8920 0.0181 8.5085 2.4016 6.2144 1.0940 1.8258 0.1986 0.5768 7.1200 3.9014 11.8264 5.7802 0.4675 2.6963 0.7379 9.9099 4.7989 2.6928 0.0496 8.6200 1.0345 1.4418 7.9939 13.0463 26.2226 40.8183 11.6424 92.6039
temp: 298.150 k
press: 1.00000 atm
elementType: 6 6 6 6 6 6 6 6 6 6 6 6 1 1 1 1 1 1 1 1
symmnumber: 1
zpe: 403861.1 jmol-1
zpe.correction: 0.153823 hartree
zpe.thermalcorrener: 0.162920 hartree
zpe.thermalcorrenthalpy: 0.163864 hartree
zpe.thermalcorrgfe: 0.119719 hartree
zpe.sumelectzpe: -461.229767 hartree
zpe.sumelectthermal: -461.220669 hartree
zpe.sumelectthermalent: -461.219725 hartree
zpe.sumelectthermalfe: -461.263870 hartree
dipole: 0.6378 0.3429 0.0030
dipole: 0.7241
quadrupole: -59.2225 -57.4607 -75.5617
quadrupole: 1.4946 -0.0109 -0.0069
quadrupole: 4.8591 6.6210 -11.4801 1.4946 -0.0109 -0.0069
hfenergy: -461.3835892 hartree
pointgroup: C01 [X(C12H8)]
dipole: 0.2503057 0.1360659 0.0011801 debye
dipolederiv: -0.0022496 -0.0954818 0.0000259 -0.207824 -0.0496765 -0.0000491 -0.0000654 -0.0000688 -0.0093954 0.0281457 -0.1143759 -0.0000093 -0.0746077 -0.0869145 -0.0000372 -0.0000042 -0.0000364 0.0746844 0.2414722 0.1109108 0.000027 0.0980357 0.0994917 -0.0000251 0.0000822 0.0000526 0.0194691 -0.0724581 0.0843202 0.0000139 0.0392591 0.013542 0.0000201 0.0000156 0.0000334 -0.1375821 0.0274681 0.0738321 0.000024 -0.0402768 0.040881 -0.0000017 0.0000092 0.0000242 -0.1766809 0.0556938 0.0621606 0.0000348 0.1261781 0.0365734 0.0000437 0.0000331 0.0000404 -0.1800088 0.0595424 -0.0102186 0.0000169 0.0154111 -0.0903244 0.0000424 -0.0000427 -0.000065 -0.1536025 -0.1580919 -0.0438974 -0.0000247 0.0150961 0.1517414 0.000044 -0.0000097 0.000044 -0.1533035 -0.0813033 -0.0246054 0.0000091 0.0201359 0.1626263 0.0000442 0.0000169 0.0000396 -0.1617248 0.1418595 0.018652 0.0000374 0.0095899 -0.0859764 0.0000107 0.0000253 0.0000079 -0.1561708 0.1001557 0.1523995 0.000206 0.2721087 0.1072891 0.0002642 0.0009029 0.0007595 0.0045827 -0.5258502 -0.1417158 -0.0003426 -0.2536545 -0.4288178 -0.0003693 -0.0016595 -0.0013888 -0.3377177 0.0486014 -0.0967415 -0.0000244 -0.0508587 0.0025896 -0.0000078 -0.0000237 -0.0000291 0.1510496 -0.0126002 -0.1278696 -0.0000309 -0.0589136 -0.0177249 -0.0000236 -0.0000252 -0.0000334 0.1562737 -0.0049688 -0.0600384 -0.0000224 -0.1283484 -0.03535 -0.0000338 -0.0000267 -0.000026 0.1557939 -0.0844227 0.0434075 -0.0000213 0.0312105 0.0885283 -0.0000089 -0.0000259 -0.0000081 0.1565742 0.0638882 0.0653954 -0.0000034 0.0499775 -0.119716 -0.0000209 0.0000127 -0.0000167 0.161873 0.0552226 0.0613935 -0.000006 0.078103 -0.1072264 -0.0000195 -0.0000042 -0.0000229 0.158874 -0.1362421 0.0463588 -0.0000267 0.0525808 0.0817305 -0.0000025 -0.0000246 -0.0000051 0.1617635 0.2561373 -0.0038859 0.0001166 0.006797 0.2367335 0.0001302 0.0008139 0.0006986 0.2652484 unknown
polarizability: 181.6849624|7.6166378|162.5383865|0.0183774|0.0152385|48.6501566 unknown
InChI: InChI=1S/C12H8/c1-2-10-7-5-8-11-6-3-4-9-12(10)11/h1,3-9H
charge 0 multiplicity 1
20 atoms
C  0.061559 -0.260019 -0.000134
C  1.030972 0.816741 0.000079
C  -1.351615 0.069152 -0.000239
C  0.531234 -1.613691 -0.000237
C  0.576279 2.176756 0.000173
C  2.42943 0.495596 0.00019
C  -1.752789 1.419538 -0.000163
C  -0.789814 2.469849 0.000046
C  1.900142 -1.895003 -0.000123
C  2.858686 -0.832679 0.000093
C  -2.343217 -0.969701 -0.000504
C  -3.186416 -1.873043 -0.000528
H  -0.202741 -2.426447 -0.000397
H  1.317847 2.984241 0.00033
H  3.158571 1.314599 0.000352
H  -2.821257 1.657471 -0.000269
H  -1.130544 3.510531 0.000104
H  2.245678 -2.934577 -0.000196
H  3.928738 -1.067297 0.000179
H  -3.929643 -2.648821 0.001643
