program: Gaussian 09
title: 000123210
version: EM64L-G09RevD.01
frameworkgroup: C1[X(C6H5NO2)]
method: RPBEPBE
basis: SDD
operation: Freq
keyword: #pfreq=noraman
keyword: PBEPBE/SDD
title: #p freq=noraman PBEPBE/SDD
converged: NO YES NO YES
title: Mulliken charges:
elementType: O O N C C C C C C H H H H H
charge: -0.207294 -0.207291 0.023681 0.371036 -0.339399 -0.339401 -0.188310 -0.188311 -0.224915 0.287415 0.287416 0.242137 0.242137 0.241099
chargesum: 0.00000
title: Mulliken charges with hydrogens summed into heavy atoms:
elementType: O O N C C C C C C
charge: -0.207294 -0.207291 0.023681 0.371036 -0.051983 -0.051985 0.053827 0.053826 0.016185
polarizability: 1.10171791e+02 3.09653905e-05 8.94297149e+01 -3.63191577e-03 -7.61330119e-04 2.98716853e+01
1716.lowfreq: -13.2732 -9.9776 -1.6877 -0.0006 -0.0005 -0.0003 63.5356 164.8985 240.2164
frequency: 63.5340 164.8984 240.2123 382.5260 405.2486 433.6206 499.5222 607.5875 657.5616 666.6747 686.9720 785.1056 788.4446 854.3199 956.0345 989.7069 994.6818 1008.9866 1016.7553 1078.1929 1091.3288 1174.3555 1176.3587 1222.2266 1306.1697 1372.0002 1399.9695 1453.1494 1460.1917 1596.7281 1606.7332 3141.9668 3155.4114 3169.0830 3185.2242 3189.1569
redmass: 7.8343 5.0941 6.4269 9.3256 2.8556 3.7073 8.2634 6.4439 8.1200 5.2081 1.9183 9.5607 1.8240 1.2429 1.3920 6.2915 1.3793 1.3298 2.3024 1.4740 3.2968 1.0575 1.2455 7.5568 1.3339 9.9893 8.8549 2.4757 2.1303 6.1038 7.1052 1.0863 1.0906 1.0954 1.0952 1.0984
irintensity: 0.0000 0.6864 1.5657 1.1457 0.0000 1.0077 0.6656 0.0294 12.7002 12.1425 74.5364 17.1253 49.2336 0.0000 7.8666 0.2663 0.0000 1.0418 6.1657 18.1998 14.8264 0.0229 32.0195 228.1696 0.0022 117.3199 0.0114 36.8837 5.8630 10.7257 0.0210 0.6751 14.1521 10.3756 0.3935 10.9245
temp: 298.150 k
press: 1.00000 atm
elementType: 8 8 7 6 6 6 6 6 6 1 1 1 1 1
symmnumber: 1
zpe: 263062.6 jmol-1
zpe.correction: 0.100195 hartree
zpe.thermalcorrener: 0.107187 hartree
zpe.thermalcorrenthalpy: 0.108131 hartree
zpe.thermalcorrgfe: 0.068193 hartree
zpe.sumelectzpe: -436.111581 hartree
zpe.sumelectthermal: -436.104590 hartree
zpe.sumelectthermalent: -436.103645 hartree
zpe.sumelectthermalfe: -436.143583 hartree
dipole: -5.2482 0.0000 0.0008
dipole: 5.2482
quadrupole: -55.1943 -47.2379 -53.3617
quadrupole: 0.0000 0.0020 -0.0002
quadrupole: -3.2630 4.6934 -1.4303 0.0000 0.0020 -0.0002
hfenergy: -436.2117761 hartree
pointgroup: C01 [X(C6H5N1O2)]
dipole: -2.0647855 -0.0001197 0.0003112 debye
dipolederiv: -0.6932475 -0.2048886 -0.0000011 -0.1761005 -0.6710269 -0.0000935 0.0001086 0.0001472 -0.2307725 -0.6932908 0.2048902 -0.0000005 0.1761032 -0.6709909 0.0000897 0.0001071 -0.0001475 -0.2307694 1.6731192 0.0000266 -0.0000855 0.000025 1.0940853 0.0000063 -0.0000627 0.0000017 0.1948536 -0.5683509 -0.0000328 0.0000665 -0.0000334 0.0434668 -0.0000033 -0.0000468 -0.0000018 0.0556528 0.112629 0.1213167 0.0000042 -0.1524287 -0.049384 0.0000183 -0.0000642 -0.0000039 -0.104499 0.1126274 -0.1212984 0.0000078 0.1524479 -0.0493821 -0.0000204 -0.0000657 0.0000044 -0.1045001 -0.1542753 -0.1856595 0.0000081 -0.1989717 0.0682696 -0.0000048 0.0000136 -0.0000155 -0.1433843 -0.1543185 0.1856349 0.0000015 0.198948 0.0683107 -0.0000032 0.0000069 0.0000068 -0.1433847 0.1877089 0.0000086 0.0000061 0.000007 0.0373367 -0.0000029 0.0000017 -0.0000033 -0.1234905 0.1055461 -0.0643489 -0.0000037 -0.0296265 0.0586117 -0.0000023 -0.000003 0.0000041 0.1752514 0.1055355 0.064354 -0.000006 0.0296317 0.0586222 0.0000071 -0.0000058 -0.0000022 0.1752518 0.0317544 0.0735749 0.0000015 0.0855161 -0.0441922 0.0000047 0.0000119 0.0000111 0.1597043 0.0317716 -0.0735667 0.0000041 -0.0855076 -0.0442093 0.0000032 0.0000151 -0.0000023 0.1597046 -0.0972089 -0.0000109 -0.000003 -0.0000105 0.1004823 0.0000011 -0.0000167 0.0000011 0.160382 unknown
polarizability: 110.1717909|0.0011598|89.429715|-0.0036319|-0.0007615|29.8716853 unknown
InChI: InChI=1S/C6H5NO2/c8-7(9)6-4-2-1-3-5-6/h1-5H
charge 0 multiplicity 1
14 atoms
O  2.387225 1.140178 -0.000271
O  2.387351 -1.139897 -0.000273
N  1.780821 0.000104 0.000119
C  0.295427 0.000025 0.000078
C  -0.384944 1.237395 0.000038
C  -0.384807 -1.237419 0.000084
C  -1.794968 1.227513 0.000016
C  -1.794834 -1.227691 0.000059
C  -2.499533 -0.000127 0.000025
H  0.189636 2.167215 0.00004
H  0.189873 -2.167175 0.000116
H  -2.343521 2.1748 -0.000008
H  -2.343284 -2.175037 0.000071
H  -3.594641 -0.000186 0.000005
