program: Gaussian 09
title: 000123209
version: EM64L-G09RevD.01
frameworkgroup: C1[X(C6H8N2O2)]
method: RPBEPBE
basis: SDD
operation: Freq
keyword: #pfreq=noraman
keyword: PBEPBE/SDD
title: #p freq=noraman PBEPBE/SDD
converged: NO YES NO NO
title: Mulliken charges:
elementType: O O N N C C C C C C H H H H H H H H
charge: -0.255391 -0.262110 -0.206459 -0.355753 0.290065 0.156639 0.195971 -0.288974 -0.602036 -0.757189 0.261386 0.346870 0.250817 0.271270 0.250580 0.248891 0.248909 0.206513
chargesum: 0.00000
title: Mulliken charges with hydrogens summed into heavy atoms:
elementType: O O N N C C C C C C
charge: -0.255391 -0.262110 -0.206459 -0.008884 0.290065 0.156639 0.195971 -0.027587 0.170631 -0.052876
polarizability: 1.09861606e+02 6.69167881e+00 9.60650058e+01 -1.66095482e-02 2.79071684e-02 4.46625590e+01
1716.lowfreq: -13.0299 -8.6083 -0.0007 -0.0006 -0.0004 11.5406 62.5664 102.3171 114.3697
frequency: 62.3735 102.3048 114.3642 131.2030 239.8255 269.8199 310.8527 332.4234 381.8389 439.4820 459.0293 492.0973 591.4037 627.3920 646.6202 721.3059 744.5920 781.5776 881.8196 914.5097 964.7300 1037.7217 1051.7853 1105.7404 1130.5574 1202.5603 1239.5474 1248.6595 1342.3240 1369.7350 1407.4748 1421.4296 1446.0786 1448.9049 1472.7324 1474.3525 1476.9223 1584.8813 1658.0530 1668.0362 2988.3479 3013.1235 3070.4212 3095.5098 3104.5325 3143.0913 3170.0601 3567.1516
redmass: 1.0270 3.7174 1.7810 1.8432 4.1632 2.7968 4.1266 3.6361 8.1646 3.5453 6.4034 8.4499 4.2364 1.2301 6.1227 5.3452 7.6978 6.7704 1.3484 3.5954 1.9939 1.9867 1.4579 2.6604 1.3138 2.4590 3.3220 3.8150 1.8961 2.4095 1.2603 1.4267 2.1038 1.0432 1.0759 1.0455 1.1028 8.1334 6.6207 5.9805 1.0361 1.0330 1.0975 1.1006 1.1021 1.1021 1.0948 1.0784
irintensity: 0.1333 3.1934 4.4472 4.5981 5.4155 2.8809 0.8861 9.0094 23.5944 1.2082 12.1680 6.6110 1.3824 95.2158 0.6439 33.3406 23.9949 4.1877 17.0379 1.5486 19.1682 22.5787 6.2453 40.4596 0.1343 43.8836 2.2448 28.8506 29.5404 45.6013 13.9946 52.4318 74.9230 13.8614 7.3377 17.3019 10.9703 383.4710 416.3076 123.8924 23.9758 21.2074 13.7693 17.5914 16.8455 0.8672 7.9147 84.7009
temp: 298.150 k
press: 1.00000 atm
elementType: 8 8 7 7 6 6 6 6 6 6 1 1 1 1 1 1 1 1
symmnumber: 1
zpe: 365754.0 jmol-1
zpe.correction: 0.139308 hartree
zpe.thermalcorrener: 0.149003 hartree
zpe.thermalcorrenthalpy: 0.149947 hartree
zpe.thermalcorrgfe: 0.104189 hartree
zpe.sumelectzpe: -492.678644 hartree
zpe.sumelectthermal: -492.668950 hartree
zpe.sumelectthermalent: -492.668006 hartree
zpe.sumelectthermalfe: -492.713763 hartree
dipole: 1.8361 -3.5326 -0.0005
dipole: 3.9813
quadrupole: -65.2640 -53.4650 -58.9337
quadrupole: -9.7660 0.0049 -0.0014
quadrupole: -6.0431 5.7559 0.2872 -9.7660 0.0049 -0.0014
hfenergy: -492.8179527 hartree
pointgroup: C01 [X(C6H8N2O2)]
dipole: 0.6275921 -1.4351243 0.0002299 debye
dipolederiv: -0.6874866 -0.1954765 0.0003119 -0.3765462 -1.0417296 0.0005316 -0.000167 0.0003791 -0.3551403 -1.3918941 -0.1574091 0.0002679 -0.0591888 -0.4977816 0.0000084 0.0007488 0.0001666 -0.382447 -1.1301962 -0.300867 0.0006196 -0.2891851 -0.7231555 -0.0001622 -0.0003095 0.0011287 -0.199258 -1.1647071 -0.2991419 0.0005423 0.5198919 -0.5387641 -0.0002179 0.0000465 -0.000046 -0.3082831 0.1318699 0.1357733 -0.0001658 -0.1152772 -0.6802677 0.0001963 0.0003029 0.0001636 -0.0960347 1.1667409 0.0934838 -0.0003996 0.4392823 1.2691836 -0.000424 -0.0003945 -0.0002524 0.2216094 1.8603484 0.2430646 -0.0008206 -0.1506648 1.0573452 -0.0000034 -0.001009 -0.0004 0.2894565 0.7525668 0.5398864 -0.0003583 0.0867093 0.3599788 -0.0002938 -0.000232 -0.0001481 -0.0623197 0.1105825 -0.0961429 -0.0005171 -0.1812403 0.2719344 0.0013765 0.0000847 0.0009271 0.1997662 -0.0755311 -0.0317507 0.0000253 -0.077505 0.0677327 0.0000563 -0.0000313 0.0000038 0.0608979 0.0401251 0.0660997 0.0000039 0.0744267 -0.0207264 0.0000915 -0.0001092 0.000069 0.1724797 0.1553202 0.0228069 0.0000339 0.0542804 0.2545297 0.00009 0.0000891 0.0001177 0.3538965 0.0247562 0.067163 -0.0863098 0.0133609 0.0759973 -0.0380642 -0.0842573 0.0180184 -0.036574 0.1170088 -0.1519681 0.002087 -0.0140114 0.0471594 0.0010468 0.0011177 0.0007322 0.1284012 0.0268575 0.0678068 0.084683 0.016245 0.0744331 0.0357873 0.0841631 -0.0208442 -0.0414845 0.021179 -0.0191704 -0.0344334 -0.0425969 0.069863 -0.0957519 -0.0799095 -0.0715308 -0.0275399 0.0213108 -0.0191243 0.0344178 -0.0425653 0.0699031 0.0957685 0.0798682 0.0714923 -0.0275382 0.0211488 0.0349663 0.0000122 0.1445845 -0.1156354 -0.0000358 -0.0000017 0.000023 0.110112 unknown
polarizability: 110.6945946|5.708944|95.2320199|-0.0333553|0.007171|44.6625564 unknown
InChI: InChI=1S/C6H8N2O2/c1-4-3-7-6(10)8(2)5(4)9/h3,7H,1-2H3
charge 0 multiplicity 1
18 atoms
O  1.231789 1.940243 -0.001606
O  -2.715992 -0.6266 0.000796
N  -0.748283 0.670291 -0.000905
N  -0.637913 -1.6933 0.000097
C  1.443307 -0.46819 -0.00078
C  0.686011 0.796218 -0.001125
C  -1.455825 -0.547719 -0.000178
C  0.753534 -1.65587 -0.000119
C  -1.570082 1.901802 -0.001037
C  2.948737 -0.377812 -0.000937
H  1.259436 -2.624972 0.000318
H  -1.145071 -2.579561 0.000831
H  -2.223557 1.918044 -0.888566
H  -0.878371 2.756114 -0.012885
H  -2.206252 1.930928 0.898831
H  3.30575 0.181283 0.882726
H  3.305529 0.181303 -0.884669
H  3.414354 -1.378403 -0.000994
