program: Gaussian 09
title: 000123196
version: EM64L-G09RevD.01
frameworkgroup: C1[X(C4H4N2O3)]
method: RPBEPBE
basis: SDD
operation: Freq
keyword: #pfreq=noraman
keyword: PBEPBE/SDD
title: #p freq=noraman PBEPBE/SDD
converged: NO NO NO NO
title: Mulliken charges:
elementType: O O O N N C C C C H H H H
charge: -0.159688 -0.192474 -0.145627 -0.186020 -0.399680 0.138996 0.261906 0.133229 -0.596651 0.363565 0.258382 0.258120 0.265942
chargesum: 0.00000
title: Mulliken charges with hydrogens summed into heavy atoms:
elementType: O O O N N C C C C
charge: -0.159688 -0.192474 -0.145627 -0.186020 -0.036115 0.138996 0.261906 0.133229 0.185793
polarizability: 8.82294914e+01 -8.76315022e+00 7.14767582e+01 4.62341658e-02 4.02826481e-02 3.20289192e+01
1716.lowfreq: -4.6517 -0.0007 -0.0004 0.0004 7.8806 12.4106 28.2676 119.6949 168.2691
frequency: 28.0895 119.6941 168.2659 224.6037 254.5113 310.3742 360.4295 471.9221 529.0491 619.0987 639.6435 668.9649 688.5285 721.2177 771.6824 899.8445 1012.0344 1091.8630 1129.8633 1214.7096 1266.7944 1317.3607 1355.2088 1440.0308 1469.4965 1482.9760 1665.3417 1699.6382 1724.6052 3009.0116 3105.5710 3124.8609 3577.4550
redmass: 1.0271 6.0550 11.6051 4.5801 3.1526 15.1560 10.2417 6.8080 8.4643 12.1702 1.1892 4.6646 7.6037 9.5041 11.8161 3.2743 3.1585 5.5622 1.3102 3.0933 4.5608 1.7277 5.7356 1.2524 1.0415 1.0683 10.7521 9.7083 11.3423 1.0328 1.1030 1.1023 1.0808
irintensity: 0.0037 2.4044 8.8621 2.7960 2.9419 4.4640 24.2074 1.2872 16.5215 7.3940 135.5731 0.2589 12.6092 43.6372 1.2031 2.7726 38.2930 71.4780 0.1092 17.0402 160.7237 16.2816 153.3035 79.5379 19.9851 10.7521 723.5167 215.6047 24.0424 19.7820 13.4692 0.7098 77.6575
temp: 298.150 k
press: 1.00000 atm
elementType: 8 8 8 7 7 6 6 6 6 1 1 1 1
symmnumber: 1
zpe: 228263.9 jmol-1
zpe.correction: 0.086941 hartree
zpe.thermalcorrener: 0.095107 hartree
zpe.thermalcorrenthalpy: 0.096051 hartree
zpe.thermalcorrgfe: 0.052981 hartree
zpe.sumelectzpe: -489.371448 hartree
zpe.sumelectthermal: -489.363282 hartree
zpe.sumelectthermalent: -489.362338 hartree
zpe.sumelectthermalfe: -489.405408 hartree
dipole: 2.7300 -0.9020 0.0027
dipole: 2.8752
quadrupole: -62.8375 -51.9755 -49.2158
quadrupole: 11.0865 0.0034 -0.0038
quadrupole: -8.1612 2.7008 5.4605 11.0865 0.0034 -0.0038
hfenergy: -489.4583896 hartree
pointgroup: C01 [X(C4H4N2O3)]
dipole: 1.1191316 -0.1646202 -0.0002633 debye
dipolederiv: -0.6436937 0.167645 -0.000702 0.4384364 -0.7913279 0.0013633 0.0005197 -0.0000268 -0.3032792 -1.0673759 0.2990426 0.0012072 0.2337043 -0.6368967 -0.0003679 0.000868 0.0000357 -0.3439347 -1.0162563 -0.082588 0.0013493 -0.2422621 -0.4439895 0.0006737 0.0017388 0.0003877 -0.3014467 -1.0443224 0.4170941 -0.0008577 0.1370716 -1.1032011 -0.0006355 0.0025821 0.0017335 -0.2096191 -1.3646893 -0.2236024 0.0015262 0.0544609 -0.6483974 -0.0001172 0.0016641 0.0004867 -0.3677821 1.3258671 -0.4981393 0.0011424 -0.5377022 0.7323389 -0.0009403 -0.0001125 0.0004498 0.2412233 1.7102124 -0.1807295 -0.0027177 -0.0717544 1.6466633 -0.0004322 -0.0031053 -0.0009463 0.3398672 1.5998544 -0.0808165 -0.0017239 -0.2190045 0.5661782 -0.0003571 -0.002077 -0.000179 0.2697378 0.2311783 0.1707002 0.0021689 0.233072 0.2534632 0.0035716 0.000375 0.0032202 0.2159018 0.1578664 0.0155181 0.0004344 -0.003679 0.2438666 0.0003719 0.0006285 0.0001641 0.3812851 0.0135631 -0.0586397 0.0762758 -0.0085109 0.0854658 -0.054119 0.0912116 0.0003484 -0.0224461 0.017321 -0.0619461 -0.0725553 -0.0173991 0.0837395 0.0471099 -0.0915555 -0.0088476 -0.0352521 0.0804748 0.1164616 -0.0055476 0.003567 0.0120969 0.0038788 -0.0027375 0.0031734 0.1357448 unknown
polarizability: 90.7057538|-5.4015225|69.0005721|-0.034309|0.0091781|32.028843 unknown
InChI: InChI=1S/C4H4N2O3/c1-6-3(8)2(7)5-4(6)9/h5H,1H3
charge 0 multiplicity 1
13 atoms
O  -1.287642 1.889342 -0.004298
O  2.238269 -1.225652 -0.00518
O  -2.468271 -0.969436 0.003051
N  0.727557 0.62306 -0.004086
N  -0.138717 -1.473976 0.000022
C  -0.671052 0.80586 -0.003984
C  1.0850 -0.752204 -0.003535
C  -1.269013 -0.637117 0.000222
C  1.716908 1.708026 -0.005354
H  -0.162848 -2.49474 0.002311
H  2.375379 1.62794 -0.885764
H  2.334356 1.670654 0.907329
H  1.163975 2.660242 -0.039535
