program: Gaussian 09
title: 000123189
version: EM64L-G09RevD.01
frameworkgroup: C1[X(C5H6O2)]
method: RPBEPBE
basis: SDD
operation: Freq
keyword: #p
keyword: freq=noraman
keyword: PBEPBE/SDD
title: #p freq=noraman PBEPBE/SDD
converged: YES YES NO YES
title: Mulliken charges:
elementType: O O C C C C C H H H H H H
charge: -0.221325 -0.222960 -0.528993 -0.331805 -0.161215 -0.199486 0.217275 0.259346 0.259340 0.235902 0.235890 0.230409 0.227622
chargesum: 0.00000
title: Mulliken charges with hydrogens summed into heavy atoms:
elementType: O O C C C C C
charge: -0.221325 -0.222960 -0.010307 0.139987 0.069194 0.028136 0.217275
polarizability: 6.98531645e+01 -8.89408991e+00 6.27301035e+01 -5.32047712e-03 1.24040729e-03 3.36973979e+01
1716.lowfreq: -17.1338 -13.8300 0.0006 0.0007 0.0013 11.0985 41.5831 102.9881 365.7768
frequency: 41.3702 102.9524 365.7753 420.6502 492.7769 521.8764 524.1607 669.2038 700.7739 852.9542 914.0479 937.9278 950.9567 979.0776 998.2785 1065.3260 1116.9862 1184.6523 1201.9803 1207.4893 1326.3399 1365.9552 1378.4927 1435.9716 1466.9994 1660.9167 1705.4600 2984.7731 2991.2945 3023.7697 3037.4093 3120.9393 3150.8880
redmass: 2.0384 5.0637 2.0579 8.6449 8.0718 6.9070 2.8603 1.1994 5.5377 6.2082 3.5040 1.7650 3.1369 1.3350 1.7426 2.7570 2.2534 1.0872 1.0847 1.3828 1.6896 1.4269 1.6618 1.0749 1.0867 12.2148 6.7501 1.0610 1.0580 1.0974 1.1053 1.0848 1.1007
irintensity: 12.5407 0.9244 0.0159 2.9564 2.6063 1.2328 0.0173 75.2122 9.8888 15.5594 22.7750 0.0220 21.6713 1.1272 6.9458 103.4267 95.4231 0.2132 2.2239 65.0476 10.6413 13.8171 0.5038 18.3791 10.3172 274.3449 4.9647 7.0655 43.5185 5.0694 19.4598 5.6609 26.1014
temp: 298.150 k
press: 1.00000 atm
elementType: 8 8 6 6 6 6 6 1 1 1 1 1 1
symmnumber: 1
zpe: 262570.9 jmol-1
zpe.correction: 0.100008 hartree
zpe.thermalcorrener: 0.106369 hartree
zpe.thermalcorrenthalpy: 0.107313 hartree
zpe.thermalcorrgfe: 0.068844 hartree
zpe.sumelectzpe: -344.023995 hartree
zpe.sumelectthermal: -344.017634 hartree
zpe.sumelectthermalent: -344.016690 hartree
zpe.sumelectthermalfe: -344.055159 hartree
dipole: 4.8228 1.6931 0.0023
dipole: 5.1114
quadrupole: -46.6438 -37.5168 -40.5803
quadrupole: -4.6691 -0.0037 -0.0007
quadrupole: -5.0635 4.0635 1.0000 -4.6691 -0.0037 -0.0007
hfenergy: -344.1240031 hartree
pointgroup: C01 [X(C5H6O2)]
dipole: -1.9349635 0.5476436 -0.0008858 debye
dipolederiv: -0.9146426 -0.2248203 -0.0000565 -0.6710477 -0.8301177 -0.0000446 0.0000845 0.0000655 -0.2871896 -1.2018585 -0.118788 -0.0002309 0.0176167 -0.5091602 0.0000404 -0.0001902 0.0000448 -0.354328 -0.1152634 0.0813482 -0.0000061 0.083734 -0.2848419 0.0002153 0.0001168 0.0005899 0.1961867 0.629229 0.1299171 0.0002061 0.0788077 0.1722824 0.0000589 0.0000458 -0.0001657 0.4054382 0.2213143 0.0181356 -0.0003436 0.0251019 0.0163543 0.0000818 -0.0004186 -0.0002254 -0.2229058 -0.0670162 -0.0775739 -0.0002387 -0.0707273 0.0735467 0.0000898 -0.0001497 0.0002813 -0.2639142 1.5947118 0.2285841 0.0003894 0.495923 1.1992045 -0.0002316 0.0002317 -0.0003313 0.2302682 0.015543 -0.0390508 0.0455961 -0.0067139 0.0766323 0.0635448 0.060126 0.103325 0.0080087 0.0154409 -0.0391649 -0.0456041 -0.0068779 0.076274 -0.0637144 -0.0600979 -0.1034597 0.0084603 -0.0150531 -0.0219122 0.0316177 -0.0354673 -0.0044911 0.0778925 0.0642487 0.1331003 -0.0340493 -0.0151149 -0.021703 -0.0316042 -0.0353998 -0.0043054 -0.0778356 -0.0643295 -0.1331462 -0.0343844 -0.0280836 0.0955167 0.0001145 0.113164 -0.0551012 -0.0001027 0.0001486 -0.0001388 0.1699346 -0.1192068 -0.0104886 0.0001604 0.0118866 0.0737235 0.0000056 0.0001838 0.0000602 0.1784746 unknown
polarizability: 68.7292963|9.265373|63.8539717|-0.0052337|-0.0015667|33.6973979 unknown
InChI: InChI=1S/C5H6O2/c6-5-3-1-2-4-7-5/h1-2H,3-4H2
charge 0 multiplicity 1
13 atoms
O  0.406854 -1.201684 0.000018
O  2.331024 0.00402 0.000137
C  0.284864 1.326875 -0.000881
C  -1.075767 -1.324985 -0.00042
C  -1.218313 1.18208 0.00022
C  -1.830372 -0.024071 0.000389
C  1.085002 0.0232 -0.000063
H  0.62727 1.908276 -0.880074
H  0.628483 1.910061 0.87662
H  -1.320704 -1.930966 0.892915
H  -1.32045 -1.929734 -0.894679
H  -1.81064 2.10515 0.000814
H  -2.92405 -0.105722 0.001104
