program: Gaussian 09
title: 000123187
version: EM64L-G09RevD.01
frameworkgroup: C1[X(C16H16O10)]
method: RPBEPBE
basis: SDD
operation: Freq
keyword: #p
keyword: freq=noraman
keyword: PBEPBE/SDD
title: #p freq=noraman PBEPBE/SDD
converged: YES YES NO NO
title: Mulliken charges:
elementType: O O O O O O O O O O C C C C C C C C C C C C C C C C H H H H H H H H H H H H H H H H
charge: -0.265929 -0.245291 -0.240229 -0.285018 -0.283452 -0.220159 -0.218601 -0.214364 -0.229719 -0.235139 0.037903 0.197401 0.173558 0.172820 0.164460 -0.500666 0.139680 0.133513 0.121446 0.160444 0.159203 -0.499432 -0.505541 -0.503138 -0.497325 -0.497273 0.320656 0.233868 0.253599 0.251470 0.231100 0.240751 0.256909 0.230687 0.251402 0.250682 0.236480 0.246724 0.246746 0.246886 0.245675 0.237216
chargesum: 0.00000
title: Mulliken charges with hydrogens summed into heavy atoms:
elementType: O O O O O O O O O O C C C C C C C C C C C C C C C C
charge: -0.265929 -0.245291 -0.240229 -0.285018 -0.283452 -0.220159 -0.218601 -0.214364 -0.229719 -0.235139 0.037903 0.197401 0.173558 0.172820 0.164460 -0.180010 0.139680 0.133513 0.121446 0.160444 0.159203 0.239504 0.223219 0.229633 0.232625 0.232504
polarizability: 2.78300084e+02 -2.53743003e-01 2.57735890e+02 -1.77276221e+00 -1.35192829e+00 1.30065767e+02
1716.lowfreq: -6.5830 -2.4894 -0.0006 -0.0005 -0.0003 3.6228 27.2882 28.4906 31.5950
frequency: 27.1636 28.4769 31.5575 47.9625 54.6841 62.1552 67.6313 74.3492 82.1816 88.0787 96.0728 97.6159 102.1776 104.4810 115.3833 121.8720 129.8009 134.4480 145.5532 170.0304 180.8089 203.6097 213.1936 222.7381 233.2943 239.6611 254.8067 259.4109 267.5673 283.3494 287.7171 297.2365 322.0845 334.7631 360.9571 402.4136 416.9615 501.6400 509.8494 555.6113 597.3144 628.7871 664.5545 687.1441 694.2700 695.4426 727.5077 741.6089 750.4983 753.0120 773.3319 785.3955 811.2410 827.9273 860.8950 905.1084 910.3351 947.5753 970.7345 977.5695 991.9162 1067.5281 1100.5769 1111.4938 1114.2746 1114.4013 1114.5970 1115.5470 1120.3670 1149.3922 1150.0260 1152.5913 1154.0830 1156.0540 1176.4586 1198.0087 1230.6912 1259.6250 1312.7223 1366.9385 1386.8512 1415.3738 1420.1413 1422.4797 1424.0115 1425.4518 1448.2744 1450.8401 1452.2481 1452.6451 1453.2501 1454.5764 1461.4760 1461.9166 1462.5492 1463.0711 1464.1397 1556.1588 1590.4159 1623.0432 1626.2378 1628.1848 1631.3796 1635.4642 3004.7964 3007.1171 3007.4154 3007.6313 3009.1895 3109.8590 3110.3203 3110.7686 3114.1561 3115.3731 3150.9821 3153.1231 3153.3964 3153.4932 3155.0949 3204.2341
redmass: 5.2391 4.9677 6.0212 4.9603 4.4344 3.8648 3.2620 2.2779 2.0621 3.2119 1.2678 1.5546 1.3020 1.2469 3.4397 1.2143 4.4349 3.4050 5.9682 5.4587 5.8920 5.5734 5.1151 6.1773 7.3365 7.0740 7.7149 6.9638 5.4683 4.2053 4.5422 4.3344 5.9971 6.4980 11.7127 8.9515 9.0579 7.7523 5.0256 9.3122 6.8233 10.5690 11.3283 8.5828 7.3186 7.2043 7.4672 6.0696 6.6675 7.1021 10.2135 7.0198 6.7123 7.5830 8.1504 9.0515 8.9760 9.4122 9.5443 1.5805 7.4697 7.9450 4.9487 1.3612 1.2925 1.2731 1.2719 1.2681 3.6141 1.4881 1.4460 1.4689 1.5354 1.5104 9.0159 6.4005 1.6468 8.1995 7.9861 11.6562 4.9743 1.2417 1.2111 1.2077 1.3301 1.2087 3.6491 1.0562 1.0497 1.0510 1.0681 1.0499 1.0521 1.0518 1.0517 1.0516 1.0520 11.3621 8.4846 10.2759 10.3045 10.5753 10.6641 10.5341 1.0290 1.0295 1.0294 1.0290 1.0291 1.1048 1.1047 1.1047 1.1051 1.1051 1.1049 1.1050 1.1049 1.1049 1.1051 1.0920
irintensity: 1.9681 0.4967 1.4566 0.4972 6.4968 3.6307 0.7739 0.5121 1.1232 0.2258 0.1494 0.4625 0.1705 0.2299 0.9752 0.1889 0.9410 0.1870 0.4820 1.1265 0.7105 1.8047 17.8151 9.0380 1.4413 2.6759 1.4728 1.6233 15.4083 43.3369 4.6514 5.0126 11.9335 15.7564 22.7531 1.0307 8.0184 11.5781 4.0401 3.8647 21.5716 1.7035 9.9275 9.8015 27.5046 22.4127 14.7731 1.6476 16.9135 3.3367 0.1792 36.7512 2.0197 10.6856 2.5556 6.7686 0.1225 42.4785 97.4338 20.9256 2.9581 74.4786 11.3771 16.4401 10.5297 1.0057 1.5177 1.3552 363.4988 41.7481 30.5275 5.8651 65.0146 16.0944 904.1434 96.9855 383.2364 20.3524 124.9092 4.7940 16.4723 37.2476 6.6179 13.4748 35.4819 22.2680 51.6827 11.4152 10.1905 25.8559 17.1313 13.6580 2.9468 15.4663 11.4613 13.9597 5.1271 29.1019 17.3715 196.5122 186.1509 220.3596 1.1192 269.2623 35.1698 29.3539 56.1089 21.5558 27.4644 18.4528 17.9968 25.0404 15.9236 15.1428 14.7977 15.0609 4.6729 22.3745 12.6614 5.7952
temp: 298.150 k
press: 1.00000 atm
elementType: 8 8 8 8 8 8 8 8 8 8 6 6 6 6 6 6 6 6 6 6 6 6 6 6 6 6 1 1 1 1 1 1 1 1 1 1 1 1 1 1 1 1
symmnumber: 1
zpe: 791772.5 jmol-1
zpe.correction: 0.301570 hartree
zpe.thermalcorrener: 0.330181 hartree
zpe.thermalcorrenthalpy: 0.331126 hartree
zpe.thermalcorrgfe: 0.239666 hartree
zpe.sumelectzpe: -1369.605162 hartree
zpe.sumelectthermal: -1369.576551 hartree
zpe.sumelectthermalent: -1369.575607 hartree
zpe.sumelectthermalfe: -1369.667066 hartree
dipole: 1.0649 4.0229 -0.9536
dipole: 4.2693
quadrupole: -126.0168 -113.6347 -157.8583
quadrupole: -8.6648 -15.4404 2.0347
quadrupole: 6.4865 18.8686 -25.3550 -8.6648 -15.4404 2.0347
hfenergy: -1369.9067322 hartree
pointgroup: C01 [X(C16H16O10)]
dipole: -0.4957716 -1.5594773 -0.3788376 debye
polarizability: 278.1271598|-1.3394179|257.82459|4.0846671|0.9180284|130.1499913 unknown
InChI: InChI=1S/C16H16O10/c1-22-12(17)7-6-8(13(18)23-2)10(15(20)25-4)11(16(21)26-5)9(7)14(19)24-3/h6H,1-5H3
charge 0 multiplicity 1
42 atoms
O  -1.075913 3.048761 -0.679411
O  -3.286021 0.78695 -0.926163
O  3.256248 1.200524 0.986287
O  2.575438 -3.072051 -0.083394
O  -2.081207 -3.333742 -0.093669
O  0.76923 3.24068 0.728578
O  -2.883325 1.571001 1.237123
O  2.824541 1.930932 -1.190838
O  3.740273 -1.141973 -0.659442
O  -3.431674 -1.591694 0.64915
C  0.00783 1.032195 0.003842
C  -1.182914 0.260571 0.061342
C  1.278926 0.401111 -0.074838
C  -1.093857 -1.160313 0.055196
C  1.352315 -1.017081 -0.13111
C  0.167993 -1.780545 -0.054991
C  -0.035119 2.535231 0.07993
C  -2.525514 0.942369 0.217782
C  2.526877 1.254064 -0.183208
C  2.671714 -1.699854 -0.316405
C  -2.321216 -1.999259 0.232858
C  -1.252316 4.520316 -0.611851
C  -4.67813 1.285451 -0.831923
C  4.516968 1.980474 0.979749
C  3.831015 -3.83749 -0.271903
C  -3.232219 -4.249972 0.090545
H  0.230279 -2.869239 -0.076551
H  -2.042062 4.740459 -1.342899
H  -0.308436 5.024802 -0.875624
H  -1.557414 4.809993 0.407446
H  -5.086839 1.172582 -1.845498
H  -4.687802 2.339993 -0.509471
H  -5.231433 0.668171 -0.10451
H  4.924445 1.861307 1.992959
H  4.301782 3.038309 0.756176
H  5.200358 1.566726 0.219538
H  3.55852 -4.879087 -0.053299
H  4.604487 -3.472687 0.424223
H  4.192537 -3.726582 -1.307872
H  -3.560459 -4.241927 1.143351
H  -4.07064 -3.93851 -0.554401
H  -2.851569 -5.238164 -0.201802
