program: Gaussian 09
title: 000123181
version: EM64L-G09RevD.01
frameworkgroup: C1[X(C7H13ClO2)]
method: RPBEPBE
basis: SDD
operation: Freq
keyword: #p
keyword: freq=noraman
keyword: PBEPBE/SDD
title: #p freq=noraman PBEPBE/SDD
converged: YES YES NO NO
title: Mulliken charges:
elementType: Cl O O C C C C C C C H H H H H H H H H H H H H
charge: -0.085445 -0.266414 -0.244158 -0.479945 -0.333203 -0.380794 -0.231231 0.253799 -0.585966 -0.678548 0.263131 0.237262 0.222421 0.253878 0.214826 0.216941 0.221236 0.221516 0.272846 0.255189 0.212470 0.226825 0.213367
chargesum: 0.00000
title: Mulliken charges with hydrogens summed into heavy atoms:
elementType: Cl O O C C C C C C C
charge: -0.085445 -0.266414 -0.244158 0.020447 0.143095 0.050972 0.211521 0.253799 -0.057931 -0.025886
polarizability: 1.15496377e+02 1.84344924e-01 8.55793226e+01 9.39576242e-01 2.04063655e+00 7.26041984e+01
1716.lowfreq: -15.0273 -6.7526 -0.0031 -0.0022 -0.0021 4.1623 14.7515 34.4681 48.5825
frequency: 10.0781 33.4054 48.1067 70.6650 75.6538 123.4852 176.3592 190.8503 219.2415 232.8072 300.8751 308.8567 405.1770 479.0858 553.2989 593.8030 679.2713 754.8416 774.8392 850.5860 870.1220 876.8873 902.4059 962.3809 983.7536 1032.2283 1050.9921 1093.4527 1125.7802 1136.1955 1142.2769 1152.8227 1190.7805 1226.4908 1263.6709 1277.9496 1295.2065 1302.8021 1308.2923 1368.0452 1379.8417 1394.7155 1441.7994 1451.9077 1452.9814 1471.1912 1478.2500 1479.9851 1489.9647 1637.7515 2980.1316 2988.5231 2997.4059 2999.2058 3004.7857 3043.3789 3045.8104 3050.8270 3065.1689 3075.1683 3084.6441 3085.6916 3133.8704
redmass: 3.7393 3.9927 2.3025 3.4392 3.4158 3.3399 3.3956 2.6083 1.1043 3.0760 3.3518 4.4941 3.5920 4.0790 2.7669 4.0209 5.5381 1.0756 1.5050 1.8423 5.1888 1.1533 1.9171 3.2653 2.3150 1.7543 2.8380 1.9242 2.5064 2.1842 1.4696 1.5516 1.4014 1.2591 1.1822 1.1001 1.3507 1.1673 1.4304 1.5209 1.7192 1.2160 1.0819 1.0959 1.0982 1.0718 1.0610 1.0413 1.0858 9.7228 1.0360 1.0659 1.0595 1.0607 1.0579 1.1017 1.0877 1.0683 1.1045 1.0955 1.0994 1.1044 1.1106
irintensity: 2.0049 0.4579 0.5728 1.2302 1.6175 3.5997 4.2575 5.3938 0.0177 2.5217 1.8392 14.7288 12.0914 1.8574 0.7178 20.8202 3.1714 7.2927 27.6603 2.1049 15.5777 2.3275 1.0985 75.2017 12.9527 17.0524 8.2158 13.7842 218.4176 7.9091 0.6187 103.0882 43.4407 0.5496 8.1286 0.0796 52.6032 16.9635 49.8474 3.4539 19.6601 9.9879 9.2739 22.8089 20.1112 2.4541 1.7113 13.3402 19.9860 175.3301 31.0875 9.0713 5.0873 11.1898 44.8118 0.6404 12.4042 12.2054 0.0507 20.9676 44.2186 92.1260 17.8748
temp: 298.150 k
press: 1.00000 atm
elementType: 17 8 8 6 6 6 6 6 6 6 1 1 1 1 1 1 1 1 1 1 1 1 1
symmnumber: 1
zpe: 500498.5 jmol-1
zpe.correction: 0.190630 hartree
zpe.thermalcorrener: 0.203249 hartree
zpe.thermalcorrenthalpy: 0.204193 hartree
zpe.thermalcorrgfe: 0.147852 hartree
zpe.sumelectzpe: -884.244254 hartree
zpe.sumelectthermal: -884.231635 hartree
zpe.sumelectthermalent: -884.230691 hartree
zpe.sumelectthermalfe: -884.287032 hartree
dipole: 1.7133 0.1354 1.9963
dipole: 2.6342
quadrupole: -63.4178 -73.2098 -66.7631
quadrupole: -7.7568 -5.1032 3.2528
quadrupole: 4.3791 -5.4129 1.0338 -7.7568 -5.1032 3.2528
hfenergy: -884.4348837 hartree
pointgroup: C01 [X(C7H13Cl1O2)]
dipole: 0.6488162 -0.0007509 -0.8081388 debye
dipolederiv: -0.333454 0.0987846 0.0527214 0.1667895 -0.4064191 -0.1487416 0.1238241 -0.1815623 -0.3283938 -1.7354501 -0.3276839 0.0606496 -0.42312 -0.5675331 0.0962708 0.0789525 0.0972322 -0.3105149 -0.7143584 0.0870142 -0.0503933 -0.2939903 -0.8553925 0.1991641 0.084426 0.2225257 -0.3760723 -0.3141138 0.0849492 -0.0642934 0.2239918 -0.1330361 0.0470035 -0.0484591 0.0447581 0.1212796 0.003049 0.0333527 -0.0097803 0.1741974 -0.0432123 -0.0161297 0.0208796 -0.0338641 0.0342825 -0.0399508 -0.0145587 -0.0057239 0.0177376 0.0835142 0.0242129 -0.0213336 0.0241933 0.1337697 0.8855039 0.0596637 0.0039537 -0.0795316 0.227469 0.0498423 0.0730436 0.0541012 0.3371012 1.7466968 0.1282259 0.0061896 0.5916552 1.1498289 -0.3377314 -0.1636611 -0.3592305 0.3061498 0.2834243 -0.1681448 -0.1226816 -0.2509935 0.5106267 0.2496626 -0.1426347 0.2342235 0.4213093 -0.0470132 0.0059901 -0.0126729 -0.0635456 0.0499557 0.0187841 0.0165781 0.0220339 0.0894705 0.1090313 0.0098216 -0.0043222 -0.0553218 0.0314539 -0.0660607 -0.0320575 -0.0777188 0.0380513 0.0446206 -0.0114179 0.0072847 -0.0511037 0.0685074 0.0649808 0.0122278 0.0906521 -0.0581038 0.0280044 0.0659184 0.0422752 -0.0127912 -0.0255629 -0.114974 -0.0158307 -0.1047151 0.0046103 0.0642522 0.0008161 0.0005639 -0.0472705 0.0661834 0.065364 0.0031227 0.0937205 -0.0483363 0.0478884 0.0094464 -0.0393468 -0.0142312 0.0637079 0.0437831 -0.023876 0.0704812 -0.1485952 0.0388652 0.0563224 0.025893 0.0252654 -0.0987337 -0.0844907 0.0347288 -0.1072101 0.0286316 -0.0472738 -0.0050615 0.0005071 0.0682018 -0.0735259 -0.0756298 -0.0037994 -0.0929906 0.0101502 -0.0449255 -0.0132228 0.0106951 0.0405955 0.0552886 0.0345279 -0.0399143 0.0457945 -0.1225702 -0.0972042 -0.0529506 0.010555 -0.0712575 -0.0384833 -0.0685612 0.0297514 -0.0528926 0.0496244 0.0820537 0.0186642 0.0513653 0.0624118 -0.0233337 0.0282451 0.00286 0.0237249 -0.1281456 0.0652024 0.0323548 0.0010199 0.0946924 -0.0982889 -0.1091365 0.025866 -0.1168704 0.0227466 -0.0975069 -0.1120033 0.0352459 -0.1414375 -0.0251593 0.0471257 0.0468633 0.0487037 0.0876466 0.0726586 0.0137192 0.000295 0.039056 0.082145 0.0524888 -0.0615574 0.0549095 -0.1640913 unknown
polarizability: 115.3167592|-1.4827461|85.0649323|-2.1593055|3.4941454|73.2982061 unknown
InChI: InChI=1S/C7H13ClO2/c1-2-6-10-7(9)4-3-5-8/h2-6H2,1H3
charge 0 multiplicity 1
23 atoms
Cl -4.26624 1.307068 0.771195
O  1.066978 0.333735 -0.17726
O  0.083147 -1.651326 0.546868
C  -1.32526 0.223047 -0.255547
C  -2.540203 -0.721261 -0.202708
C  3.447748 0.830061 -0.23191
C  2.413287 -0.229183 0.149986
C  -0.02783 -0.491335 0.085233
C  -3.86221 -0.028198 -0.521777
C  4.882715 0.349879 0.080488
H  -1.462913 1.054663 0.462669
H  -1.218035 0.69591 -1.24999
H  -2.407817 -1.539344 -0.94025
H  -2.593632 -1.207165 0.787207
H  3.348629 1.061419 -1.308928
H  3.229414 1.763875 0.31899
H  2.547567 -1.170305 -0.415229
H  2.439347 -0.470077 1.229211
H  -4.716231 -0.720277 -0.480439
H  -3.847611 0.509069 -1.483165
H  5.129328 -0.573332 -0.476555
H  5.622349 1.119933 -0.200884
H  5.010575 0.138143 1.158495
