program: Gaussian 09
title: 000123176
version: EM64L-G09RevD.01
frameworkgroup: C1[X(C4Cl2O2)]
method: RPBEPBE
basis: SDD
operation: Freq
keyword: #pfreq=noraman
keyword: PBEPBE/SDD
title: #p freq=noraman PBEPBE/SDD
converged: NO NO NO NO
title: Mulliken charges:
elementType: Cl Cl O O C C C C
charge: 0.103549 0.103557 -0.103347 -0.103344 -0.108810 -0.108828 0.108619 0.108604
chargesum: 0.00000
title: Mulliken charges with hydrogens summed into heavy atoms:
polarizability: 9.11059659e+01 1.94110554e-04 8.71115360e+01 2.60683556e-03 5.19427010e-04 2.45278910e+01
1716.lowfreq: 0.0025 0.0026 0.0030 9.3791 14.2962 14.5537 88.0521 127.4796 180.3121
frequency: 88.0488 127.4796 180.3083 192.1519 258.9941 450.4285 453.1255 459.3489 491.0640 702.9670 774.6470 822.3020 834.4596 960.4182 1109.3739 1513.4658 1712.4763 1751.6421
redmass: 18.7185 28.0127 13.7386 19.2901 17.0161 19.7014 12.3522 19.8044 12.4342 12.5056 12.1419 13.2289 12.8599 12.4586 12.2377 12.1629 13.0905 12.9863
irintensity: 0.0000 0.0506 3.3186 1.3291 1.0097 2.0446 0.0000 23.3085 7.7734 4.3035 0.0000 44.9273 35.2538 7.1881 208.7994 253.9973 171.2549 238.6604
temp: 298.150 k
press: 1.00000 atm
elementType: 17 17 8 8 6 6 6 6
symmnumber: 1
zpe: 77055.7 jmol-1
zpe.correction: 0.029349 hartree
zpe.thermalcorrener: 0.036687 hartree
zpe.thermalcorrenthalpy: 0.037632 hartree
zpe.thermalcorrgfe: -0.004054 hartree
zpe.sumelectzpe: -1222.352287 hartree
zpe.sumelectthermal: -1222.344949 hartree
zpe.sumelectthermalent: -1222.344005 hartree
zpe.sumelectthermalfe: -1222.385691 hartree
dipole: -0.0002 -3.6597 0.0001
dipole: 3.6597
quadrupole: -62.7032 -66.1122 -55.7848
quadrupole: -0.0001 0.0001 0.0007
quadrupole: -1.1698 -4.5788 5.7486 -0.0001 0.0001 0.0007
hfenergy: -1222.3816364 hartree
pointgroup: C01 [X(C4Cl2O2)]
dipole: 1.4398514 -0.0011745 -0.0000491 debye
dipolederiv: -0.4506651 0.4853818 0.0000033 0.3714241 -0.3667744 0.0000042 -0.0000573 0.0000727 0.0747567 -0.4521592 -0.4852597 -0.0000558 -0.3712785 -0.3653038 -0.0000502 -0.0000827 -0.0000898 0.0747644 -0.7401824 -0.3981262 0.0000296 -0.5566372 -0.7079938 0.000038 0.0000515 0.0000325 -0.2387934 -0.7386052 0.39819 -0.0000023 0.5566995 -0.7095977 0.0000099 0.0000632 -0.0000581 -0.2387889 0.0536158 -1.0368033 0.0000115 -0.9361251 0.5250005 -0.0000219 0.0000679 -0.0001462 -0.0186234 0.0569886 1.0375982 0.0001168 0.9368976 0.5216663 0.0000959 0.0001281 0.0001598 -0.0186292 1.1365925 0.6250223 -0.0000746 0.7163969 0.5503829 -0.0000595 -0.0000846 0.0000152 0.1826549 1.134415 -0.6260029 -0.0000286 -0.7173774 0.55262 -0.0000164 -0.0000862 0.0000139 0.1826588 unknown
polarizability: 87.1115395|0.0037136|91.1059624|0.0005217|0.0026064|24.527891 unknown
InChI: InChI=1S/C4Cl2O2/c5-1-2(6)4(8)3(1)7
charge 0 multiplicity 1
8 atoms
Cl 1.924841 -1.892688 -0.000054
Cl 1.928081 1.889407 0.00018
O  -1.70947 -1.698148 0.00008
O  -1.706633 1.701025 0.000052
C  0.64957 -0.696433 -0.000149
C  0.650756 0.695363 -0.000065
C  -0.869282 -0.79142 0.000004
C  -0.867963 0.792895 -0.000047
