program: Gaussian 09
title: 000123168
version: EM64L-G09RevD.01
frameworkgroup: C1[X(C6H15NO)]
method: RPBEPBE
basis: SDD
operation: Freq
keyword: #p
keyword: freq=noraman
keyword: PBEPBE/SDD
title: #p freq=noraman PBEPBE/SDD
converged: NO YES NO NO
title: Mulliken charges:
elementType: O N C C C C C C H H H H H H H H H H H H H H H
charge: -0.461949 0.014163 -0.280321 -0.280244 -0.280141 -0.699853 -0.699903 -0.699446 0.239680 0.194701 0.239110 0.194897 0.239335 0.194716 0.211944 0.203985 0.279169 0.211778 0.203942 0.279494 0.211685 0.203912 0.279346
chargesum: 0.00000
title: Mulliken charges with hydrogens summed into heavy atoms:
elementType: O N C C C C C C
charge: -0.461949 0.014163 0.154060 0.153763 0.153910 -0.004755 -0.004689 -0.004503
polarizability: 8.37476463e+01 1.04306529e-02 8.37275794e+01 -8.85086664e-03 1.92714464e-03 7.17834469e+01
1716.lowfreq: -16.6433 -4.2226 -0.0008 -0.0005 -0.0004 11.5172 69.5851 104.5619 109.6111
frequency: 69.2283 104.4555 109.6062 193.5815 198.4691 202.0957 233.9399 239.1351 316.6107 372.0501 372.2984 407.8781 507.8306 508.5301 638.6563 771.8852 772.6610 800.0377 870.3203 883.5690 885.1618 996.1066 996.9983 1023.0319 1072.7932 1093.5097 1093.9590 1150.5357 1162.0320 1163.0784 1265.3996 1268.0773 1284.9298 1343.6546 1344.0302 1348.1722 1370.5449 1371.5153 1382.1419 1448.6456 1452.1850 1453.2870 1470.2494 1471.0169 1472.1731 1489.7041 1490.3018 1492.7821 2985.2684 2985.6052 2986.7574 2992.4024 2993.3655 3005.0989 3077.3927 3077.7575 3081.0000 3093.6940 3093.8622 3093.9341 3104.1251 3107.6819 3108.3062
redmass: 1.8160 1.9369 1.9870 1.1683 1.1317 1.1425 2.7304 2.7005 2.3063 3.3609 3.3891 2.9291 3.2561 3.2592 2.8853 1.3656 1.3870 1.4363 3.1194 2.0402 2.0954 1.5820 1.5929 2.0462 1.9214 2.5793 2.5799 1.8129 1.9254 1.9178 1.2100 1.2103 1.1265 1.2339 1.2362 1.2780 1.2163 1.2169 1.2738 1.0801 1.0842 1.0844 1.0553 1.0575 1.0577 1.0500 1.0507 1.0564 1.0386 1.0379 1.0355 1.0619 1.0621 1.0636 1.0989 1.0989 1.0988 1.0983 1.0984 1.0978 1.1018 1.0996 1.0995
irintensity: 0.1649 1.3418 1.6600 1.9077 3.9773 4.6349 7.9523 8.3649 1.0248 15.9956 16.4901 2.4610 1.1060 1.0996 0.2972 5.0644 5.0241 0.4347 41.0771 3.0554 3.2183 16.2829 16.1268 0.7147 0.9607 3.8345 3.8194 0.0319 2.3381 2.3025 10.6202 10.4590 2.3474 11.2342 11.0950 11.3070 45.1163 45.7902 15.0021 2.9930 5.7663 5.7642 21.5946 4.7089 5.9321 17.9387 17.7997 4.0719 46.5839 46.4773 1.7271 13.0860 12.8735 94.1576 19.4240 18.9959 0.1368 3.9295 3.9265 2.6393 23.9969 45.9596 45.4033
temp: 298.150 k
press: 1.00000 atm
elementType: 8 7 6 6 6 6 6 6 1 1 1 1 1 1 1 1 1 1 1 1 1 1 1
symmnumber: 1
zpe: 539606.2 jmol-1
zpe.correction: 0.205525 hartree
zpe.thermalcorrener: 0.216065 hartree
zpe.thermalcorrenthalpy: 0.217009 hartree
zpe.thermalcorrgfe: 0.170487 hartree
zpe.sumelectzpe: -366.837611 hartree
zpe.sumelectthermal: -366.827072 hartree
zpe.sumelectthermalent: -366.826128 hartree
zpe.sumelectthermalfe: -366.872649 hartree
dipole: 0.0100 -0.0065 -4.1055
dipole: 4.1056
quadrupole: -48.8219 -48.8041 -56.7610
quadrupole: -0.0041 0.0095 -0.0070
quadrupole: 2.6404 2.6583 -5.2987 -0.0041 0.0095 -0.0070
hfenergy: -367.0431366 hartree
pointgroup: C01 [X(C6H15N1O1)]
dipole: 0.0064891 0.0013194 -1.615237 debye
dipolederiv: -0.6248194 0.0097792 -0.0002099 -0.011196 -0.6248527 -0.000106 0.0006353 -0.0000728 -0.5678954 0.0589979 -0.0019646 -0.0005969 0.0011877 0.0584431 0.0000503 -0.0019408 -0.0000459 0.3013374 0.1946155 -0.1065154 0.0297768 -0.0865873 0.0969077 -0.0345117 -0.0130486 -0.035043 0.1362103 0.2048665 0.0804779 -0.0448417 0.0999258 0.0862295 -0.0082173 -0.0240169 0.0296799 0.1354607 0.0373234 -0.0034683 0.0150575 0.0160016 0.2544134 0.0428115 0.0374885 0.0061747 0.1364883 -0.1426975 0.0361674 -0.0620947 0.0676927 0.0635385 -0.033073 0.0153467 -0.0624003 -0.0739701 -0.0325382 -0.1309792 0.0024657 -0.0996765 -0.045323 0.0700094 -0.0619239 0.0168768 -0.0759533 0.0573909 0.0475786 0.0591335 0.0785602 -0.1359961 -0.0375236 0.0462267 0.044026 -0.0742735 0.0398122 -0.0522565 0.0026827 -0.0427068 -0.0989523 0.0009586 0.0129211 0.0384542 0.0639762 -0.0057746 0.0483915 -0.0201826 0.0324631 0.0571919 0.0290019 0.0018872 -0.0171162 -0.1874868 -0.0235533 0.0790427 -0.00079 0.0887554 -0.0363059 -0.0020112 0.026665 -0.0296795 0.0641426 0.0064251 -0.0395136 0.0364632 -0.0551885 0.0451544 0.0024264 -0.0144348 0.006632 -0.1872406 -0.1050549 -0.0414218 -0.0021503 -0.0315244 0.0461051 0.001788 -0.0399053 -0.0083264 0.0637845 0.0765711 0.0147667 -0.0149974 -0.0010922 -0.0248966 -0.0319604 0.0140474 0.0099685 -0.1875229 -0.0313793 0.1045585 0.0146562 0.1419704 -0.0680558 -0.0313445 0.0258133 -0.0375387 0.1224713 0.0281442 -0.0774772 0.0111024 -0.1348587 -0.0837315 0.0753755 0.0364628 0.0867739 0.0503697 0.2153435 -0.04104 0.0407269 -0.0601018 0.1118759 -0.025475 -0.0677746 0.0098728 -0.0226196 -0.165944 -0.0641786 -0.0350166 -0.0265286 0.0661553 0.0030468 -0.0461737 -0.0037211 0.1225388 0.0360646 0.1300584 0.0595363 0.0726766 -0.0929802 -0.0472482 0.0562941 -0.0745148 0.0512244 0.1828165 0.0804632 -0.0416701 0.0615851 0.1464437 -0.0224243 0.0438387 0.0542094 -0.0216251 0.0475171 -0.0964397 0.0202388 -0.0591059 -0.1471797 0.028832 0.0198512 0.0417717 0.1222707 -0.1480871 0.033563 -0.0707372 -0.0237694 0.0920619 -0.0278057 -0.0930086 -0.0116576 0.0507658 0.0939597 -0.0095923 0.0014472 -0.0284826 0.2337536 0.0474005 0.024749 -0.0643234 -0.0224536 unknown
polarizability: 83.7312665|0.0130058|83.7439618|0.0049604|0.0051997|71.7834443 unknown
InChI: InChI=1S/C6H15NO/c1-4-7(8,5-2)6-3/h4-6H2,1-3H3
charge 0 multiplicity 1
23 atoms
O  -0.004957 -0.000742 1.38833
N  -0.001204 -0.000397 -0.033799
C  1.095512 -0.963083 -0.570311
C  -1.380747 -0.467346 -0.576801
C  0.286734 1.430048 -0.571255
C  2.453068 -0.708338 0.089626
C  -1.843226 -1.76824 0.084274
C  -0.610536 2.480109 0.088362
H  0.739268 -1.96995 -0.302983
H  1.12685 -0.86976 -1.673765
H  -2.075211 0.345722 -0.314558
H  -1.309619 -0.543226 -1.679682
H  1.337048 1.623252 -0.303397
H  0.19058 1.410454 -1.674799
H  3.111303 -1.581924 -0.062648
H  2.971945 0.179242 -0.312208
H  2.274032 -0.570624 1.17083
H  -2.928942 -1.89932 -0.069537
H  -1.335256 -2.66385 -0.314054
H  -1.636121 -1.67983 1.16569
H  -0.181862 3.486142 -0.06618
H  -1.639461 2.486883 -0.311465
H  -0.638697 2.258178 1.169929
