program: Gaussian 09
title: 000123393
version: EM64L-G09RevD.01
frameworkgroup: C1[X(C23H29N3OS)]
method: RPBEPBE
basis: SDD
operation: Freq
keyword: #p
keyword: freq=noraman
keyword: PBEPBE/SDD
title: #p freq=noraman PBEPBE/SDD
converged: YES YES NO NO
title: Mulliken charges:
elementType: S O N N N C C C C C C C C C C C C C C C C C C C C C C C H H H H H H H H H H H H H H H H H H H H H H H H H H H H H
charge: 0.230160 -0.225329 -0.076350 -0.063534 -0.246738 -0.357960 -0.347294 -0.330454 -0.379864 -0.389253 -0.415634 -0.510405 -0.614209 0.549620 0.504165 -0.393707 -0.339929 -0.484257 -0.327287 0.350490 -0.280402 -0.273473 -0.408763 -0.262359 -0.251630 0.096223 -0.484007 -0.687206 0.188835 0.203278 0.206369 0.185883 0.178268 0.201206 0.206677 0.186521 0.187168 0.208070 0.234952 0.237956 0.241199 0.247193 0.223208 0.188542 0.222909 0.258995 0.240841 0.247436 0.245058 0.284050 0.228505 0.234624 0.234707 0.227124 0.230765 0.207445 0.231599
chargesum: 0.00000
title: Mulliken charges with hydrogens summed into heavy atoms:
elementType: S O N N N C C C C C C C C C C C C C C C C C C C C C C C
charge: 0.230160 -0.225329 -0.076350 -0.063534 -0.246738 0.034154 0.044958 0.049020 0.013335 0.005984 0.057274 -0.022012 0.020450 0.549620 0.504165 -0.393707 -0.339929 -0.225262 -0.086446 0.350490 -0.032966 -0.028415 -0.124713 -0.033854 -0.017006 0.096223 -0.022176 -0.017396
polarizability: 3.41058927e+02 3.48466115e+01 4.06230952e+02 1.88881226e+01 1.69148849e+00 1.77324748e+02
1716.lowfreq: -25.1175 -5.3235 -3.2431 -0.0017 0.0007 0.0013 4.9170 10.0745 19.0144
frequency: -21.7904 9.0079 18.8933 35.8415 39.8134 52.6665 71.0976 81.4649 87.0210 94.0479 119.6794 129.8229 146.5935 184.1723 196.5202 209.6125 217.0201 223.4573 238.7615 242.2930 255.7122 260.8336 270.3400 304.1027 314.5518 329.6658 341.7119 359.4321 364.3602 388.5421 412.7881 413.3693 435.7328 446.7183 455.7032 463.1486 477.6397 493.1014 504.8458 528.1234 543.7154 601.5661 606.2586 622.4777 643.5574 662.1090 671.8651 707.4944 718.1333 728.2555 747.9460 751.4059 761.8176 774.0873 792.6907 799.6989 839.1069 843.5951 846.6432 852.2220 867.3067 914.7996 923.7087 926.0295 968.5101 976.7222 981.7012 999.2572 1011.6539 1018.5106 1023.5997 1025.6448 1038.6555 1047.2946 1049.6469 1052.7528 1067.6519 1072.9165 1083.8886 1091.9661 1096.9210 1110.2981 1126.4852 1130.7975 1141.5915 1145.1015 1149.3737 1152.1701 1178.0931 1186.9427 1192.2267 1212.6491 1227.8865 1247.5939 1249.1699 1253.5998 1269.8869 1278.8624 1281.8250 1289.2919 1292.4004 1296.1655 1306.5718 1328.7538 1335.9767 1346.0614 1349.9908 1365.9529 1369.9476 1372.0935 1373.8474 1389.6141 1396.2304 1396.5324 1404.4722 1429.4484 1430.3501 1436.4153 1452.6481 1453.2282 1459.4640 1461.5930 1468.7735 1469.4629 1472.1245 1475.7715 1477.1937 1481.2247 1483.3726 1493.0395 1502.9790 1555.2639 1572.0941 1583.7641 1600.0130 1609.3546 2821.8766 2844.6772 2848.7584 2859.3233 2864.5324 2875.5964 2962.3715 2988.8767 2993.8552 2997.1956 3008.5720 3016.3692 3018.8939 3024.5228 3026.9861 3030.7310 3041.8199 3045.3500 3074.4413 3076.8117 3092.8237 3101.9122 3134.4528 3140.9911 3142.5798 3166.4237 3171.4807 3180.8810 3191.8100
redmass: 3.1008 4.4981 4.5368 4.2470 6.7314 3.4596 2.2397 3.7228 3.9478 3.8193 3.3173 3.7654 3.6435 1.8647 2.1665 2.6015 2.1845 1.3467 5.1402 2.5002 4.4402 2.1625 4.3190 5.6308 2.4417 2.7690 4.1453 3.4326 3.4051 2.5241 4.2850 3.2421 4.5622 3.1087 5.3284 4.4344 3.6068 3.0378 3.1777 5.7749 3.8801 2.8295 3.9761 3.3100 3.9362 6.0996 5.0691 4.5005 3.0194 3.0217 1.6117 2.9059 1.2336 2.8370 3.7891 1.4339 1.3960 1.3582 1.5475 1.5535 1.6447 2.8686 1.6102 1.7264 1.3151 1.3483 3.5291 2.9885 2.7282 1.6857 2.9655 5.7673 5.0766 1.9179 2.1976 2.0213 1.6579 1.8793 1.9004 2.9482 2.9182 1.7094 1.8163 1.7296 2.3357 1.4134 2.5068 2.7184 1.0882 1.4225 1.0787 1.8809 1.9358 1.2093 1.5315 2.7162 1.3667 1.6913 1.4909 1.5293 1.2409 1.2988 1.3419 1.9052 1.2891 1.9327 1.3821 1.3862 1.4030 6.9789 1.4339 8.5101 1.3118 1.3490 3.3101 2.3693 1.1718 1.1162 1.0798 1.0794 1.0819 1.0727 1.0406 2.5512 1.0945 1.1084 1.0584 1.0535 1.7405 1.3856 1.0957 7.4169 6.1030 6.9006 7.7085 7.1512 1.0705 1.0712 1.0640 1.0685 1.0656 1.0667 1.0600 1.0853 1.0613 1.0364 1.0982 1.0608 1.0729 1.0901 1.0883 1.0888 1.0998 1.0890 1.1035 1.1010 1.1001 1.0998 1.0857 1.0894 1.0910 1.0960 1.0954 1.0962 1.0891
irintensity: 0.0026 0.1575 0.5160 0.3842 1.2690 0.1777 1.7177 0.4458 3.2176 0.3792 0.5541 0.4399 1.4264 0.8980 0.2899 0.1135 0.4042 0.2943 1.6857 0.9723 0.9131 2.6304 2.5020 7.3862 9.3485 8.8980 2.5719 1.2856 2.2780 1.5400 3.8882 2.3790 4.1510 0.7973 0.4268 14.0859 2.8897 2.8188 1.6302 6.0978 1.2172 0.5949 1.3094 4.4336 3.1307 1.9657 3.0066 4.6254 6.5224 6.1056 62.8535 30.7217 4.1160 13.3342 13.0776 43.7265 1.7743 7.7920 1.8838 10.9657 16.8456 34.4342 0.6536 3.7761 0.0380 0.6957 20.7213 35.0810 22.0613 39.8332 2.4907 33.8246 2.0567 2.4304 8.6094 0.4152 1.3764 0.5538 4.6898 6.5352 56.1093 27.8883 4.4422 20.9725 15.9078 20.3371 35.2068 30.8795 3.0021 18.7965 0.4098 95.0986 117.7148 4.9665 76.0162 25.0597 22.9697 26.2128 21.4236 5.8514 19.8150 16.4345 1.3506 18.8579 13.9445 151.4154 13.6584 4.9858 32.8185 9.2392 9.8469 10.9533 19.1087 8.0192 87.8583 25.8102 1.2598 60.2753 1.1375 0.5390 32.3229 6.4147 10.6644 246.5379 24.8810 1.0547 12.1666 8.9193 34.3545 0.8945 22.2457 229.6505 24.3136 21.7335 41.4487 54.4385 72.3497 81.4195 39.2443 10.9795 50.9608 323.2965 39.3737 14.3276 24.2589 35.2738 11.4525 24.4802 48.3745 16.5956 88.0889 45.9747 6.4097 36.6172 38.3592 34.7481 25.8611 29.1008 0.4087 4.9011 9.7200 28.9711 4.0047 14.0458 5.5931
temp: 298.150 k
press: 1.00000 atm
elementType: 16 8 7 7 7 6 6 6 6 6 6 6 6 6 6 6 6 6 6 6 6 6 6 6 6 6 6 6 1 1 1 1 1 1 1 1 1 1 1 1 1 1 1 1 1 1 1 1 1 1 1 1 1 1 1 1 1
symmnumber: 1
zpe: 1245509.6 jmol-1
zpe.correction: 0.474390 hartree
zpe.thermalcorrener: 0.500476 hartree
zpe.thermalcorrenthalpy: 0.501420 hartree
zpe.thermalcorrgfe: 0.416155 hartree
zpe.sumelectzpe: -1529.280351 hartree
zpe.sumelectthermal: -1529.254265 hartree
zpe.sumelectthermalent: -1529.253320 hartree
zpe.sumelectthermalfe: -1529.338586 hartree
dipole: 3.3831 -3.9455 1.0912
dipole: 5.3106
quadrupole: -169.1703 -190.2036 -175.5550
quadrupole: 10.9021 1.9139 7.0412
quadrupole: 9.1393 -11.8940 2.7546 10.9021 1.9139 7.0412
hfenergy: -1529.7547408 hartree
pointgroup: C01 [X(C23H29N3O1S1)]
dipole: 1.6199506 -1.2405945 0.4495925 debye
polarizability: 330.5187811|19.9525638|417.3281735|15.282987|-3.2429378|176.7676723 unknown
InChI: InChI=1S/C23H29N3OS/c1-3-21(27)18-9-10-23-20(17-18)26(19-7-4-5-8-22(19)28-23)12-6-11-25-15-13-24(2)14-16-25/h4-5,7-10,17H,3,6,11-16H2,1-2H3
charge 0 multiplicity 1
57 atoms
S  -4.498888 -1.61557 0.164467
O  -2.441299 4.846748 -0.683039
N  3.485412 0.088315 0.440843
N  6.218758 0.163181 -0.541139
N  -1.450941 -1.069371 0.729097
C  4.593691 0.634687 1.267407
C  4.004724 -0.957727 -0.478145
C  2.353675 -0.377695 1.275643
C  5.700716 1.209862 0.370429
C  5.120846 -0.388128 -1.368833
C  1.069713 -0.633224 0.458241
C  -0.152529 -0.818696 1.397716
C  7.35525 0.634751 -1.354637
C  -2.206817 0.056451 0.280324
C  -1.779927 -2.414254 0.376919
C  -3.583305 -0.057446 -0.078653
C  -3.105036 -2.79708 0.020216
C  -1.623524 1.349653 0.199094
C  -0.79251 -3.441363 0.384124
C  -2.365518 2.486959 -0.216093
C  -4.316631 1.06059 -0.530443
C  -3.416526 -4.118507 -0.353098
C  -3.722397 2.332615 -0.593405
C  -1.112934 -4.77525 0.051241
C  -2.423588 -5.124059 -0.332801
C  -1.752552 3.857355 -0.291443
C  -0.283039 4.039036 0.112334
C  0.205857 5.491028 -0.023229
H  5.040417 -0.151638 1.927245
H  4.189339 1.437202 1.912995
H  3.183632 -1.317511 -1.123444
H  4.409041 -1.83189 0.093831
H  2.617779 -1.300258 1.859541
H  2.147916 0.418455 2.020206
H  6.532665 1.575165 1.001539
H  5.286744 2.082626 -0.19755
H  4.680397 0.393175 -2.040824
H  5.52782 -1.195998 -2.005807
H  0.918108 0.223548 -0.222095
H  1.182201 -1.52358 -0.185503
H  -0.269418 0.081456 2.029882
H  0.035495 -1.658517 2.092152
H  7.745797 -0.197995 -1.966893
H  7.087755 1.475559 -2.04443
H  8.168546 0.981808 -0.69217
H  -0.57315 1.481928 0.459443
H  0.241033 -3.20858 0.647696
H  -5.366071 0.925988 -0.813425
H  -4.445535 -4.363246 -0.63833
H  -4.280925 3.212796 -0.924665
H  -0.325185 -5.535679 0.081802
H  -2.675992 -6.152947 -0.606806
H  0.341086 3.362598 -0.507704
H  -0.160259 3.685428 1.157345
H  -0.394205 6.169331 0.606869
H  1.266114 5.573263 0.276322
H  0.104071 5.843751 -1.063558
