program: Gaussian 09
title: 000123132
version: EM64L-G09RevD.01
frameworkgroup: C1[X(CH4O)]
method: RPBEPBE
basis: SDD
operation: Freq
keyword: #p
keyword: freq=noraman
keyword: PBEPBE/SDD
title: #p freq=noraman PBEPBE/SDD
converged: NO NO NO NO
title: Mulliken charges:
elementType: O C H H H H
charge: -0.471683 -0.510288 0.201747 0.201755 0.237701 0.340768
chargesum: 0.00000
title: Mulliken charges with hydrogens summed into heavy atoms:
elementType: O C
charge: -0.130915 0.130915
polarizability: 1.73413399e+01 1.05543378e+00 1.58373768e+01 -1.19750743e-04 4.60644178e-05 1.27424898e+01
1716.lowfreq: -43.2265 -38.9997 -0.0006 0.0011 0.0012 36.2109 327.7210 973.9457 1046.4986
frequency: 327.3024 973.9451 1046.4961 1108.9852 1312.5073 1455.6588 1464.2318 1474.4846 2928.6684 2999.1741 3098.1903 3592.7670
redmass: 1.0765 4.1126 1.2406 1.2547 1.3027 1.1098 1.0523 1.0531 1.0358 1.1032 1.0955 1.0665
irintensity: 170.9015 100.7678 14.1670 0.8950 16.6516 1.6238 7.0760 7.4870 77.8174 94.4832 35.1068 4.8244
temp: 298.150 k
press: 1.00000 atm
elementType: 8 6 1 1 1 1
symmnumber: 1
zpe: 130287.7 jmol-1
zpe.correction: 0.049624 hartree
zpe.thermalcorrener: 0.052967 hartree
zpe.thermalcorrenthalpy: 0.053911 hartree
zpe.thermalcorrgfe: 0.026815 hartree
zpe.sumelectzpe: -115.516187 hartree
zpe.sumelectthermal: -115.512844 hartree
zpe.sumelectthermalent: -115.511899 hartree
zpe.sumelectthermalfe: -115.538995 hartree
dipole: 1.0784 -1.8216 -0.0001
dipole: 2.1169
quadrupole: -12.4845 -12.1861 -13.6699
quadrupole: 2.5890 0.0000 0.0000
quadrupole: 0.2957 0.5941 -0.8897 2.5890 0.0000 0.0000
hfenergy: -115.5658106 hartree
pointgroup: C01 [X(C1H4O1)]
dipole: -0.4836152 -0.6422811 -0.2172665 debye
dipolederiv: -0.8003301 0.0060988 0.0020555 0.0566554 -0.1830233 0.1554243 0.0191742 0.1554375 -0.5898344 0.6684143 -0.0020784 -0.0006886 -0.0507374 0.2328487 -0.0505466 -0.0171606 -0.0505449 0.3651173 -0.085416 -0.0708358 0.0745898 -0.1135576 -0.0601314 0.1495798 0.0876272 0.1418703 -0.0509789 -0.0854151 -0.0109678 -0.1022811 -0.0369926 0.0838676 -0.0464774 -0.1385926 -0.0387651 -0.1949636 0.0394437 0.0476136 0.0161133 0.0900192 -0.109304 -0.0762949 0.0304731 -0.0763042 0.0902533 0.2633032 0.0301695 0.010211 0.054613 0.0357423 -0.1316852 0.0184787 -0.1316935 0.3804063 unknown
polarizability: 17.1518782|-1.1058011|15.6894316|-0.3744224|0.9971552|13.0798967 unknown
InChI: InChI=1S/CH4O/c1-2/h2H,1H3
charge 0 multiplicity 1
6 atoms
O  0.740079 0.00278 0.00089
C  -0.720986 -0.017007 -0.005766
H  -1.144528 -0.770182 0.692973
H  -1.144539 -0.190941 -1.018303
H  -1.033858 0.983279 0.332862
H  1.087931 -0.873429 -0.295556
