program: Gaussian 09
title: 000123126
version: EM64L-G09RevD.01
frameworkgroup: C1[X(C12H18O)]
method: RPBEPBE
basis: SDD
operation: Freq
keyword: #pfreq=noraman
keyword: PBEPBE/SDD
title: #p freq=noraman PBEPBE/SDD
converged: YES YES NO NO
title: Mulliken charges:
elementType: O C C C C C C C C C C C C H H H H H H H H H H H H H H H H H H
charge: -0.197010 0.353421 -0.101793 -0.099449 -0.099453 -0.535975 -0.540070 -0.540043 -0.447771 -0.447811 -0.453754 0.108007 -0.797809 0.200359 0.200948 0.200989 0.222990 0.222546 0.216039 0.199244 0.199335 0.216234 0.196459 0.196432 0.196460 0.196495 0.192555 0.200428 0.243322 0.243308 0.255367
chargesum: 0.00000
title: Mulliken charges with hydrogens summed into heavy atoms:
elementType: O C C C C C C C C C C C C
charge: -0.197010 0.353421 0.098566 0.101498 0.101536 -0.090439 -0.124787 -0.124474 -0.054880 -0.054856 -0.060772 0.108007 -0.055811
polarizability: 1.31111171e+02 -2.81418562e-01 1.17027887e+02 3.26224954e-03 -8.17534031e-03 1.06659758e+02
1716.lowfreq: -62.6434 -25.0164 -0.0004 -0.0002 0.0009 17.1172 18.7644 88.4772 170.8578
frequency: -62.1922 88.3070 170.8502 179.1193 295.2147 302.3529 313.1660 316.4867 379.0137 394.3752 411.7205 419.2072 443.1006 468.2334 579.5129 584.9570 637.5182 638.2619 683.7611 763.0713 805.2227 805.7316 855.5917 865.3830 874.7523 876.3573 917.7461 923.6837 960.4798 961.6281 975.9115 983.7513 1026.9877 1042.5174 1046.6475 1051.0098 1056.7089 1101.9897 1102.7371 1108.0603 1109.8671 1113.3908 1179.2160 1182.0612 1215.6748 1249.3992 1264.3301 1282.4009 1287.5349 1292.5400 1303.8961 1311.7146 1314.7709 1324.4936 1341.2039 1341.3729 1347.5611 1357.8851 1358.2994 1375.2752 1445.7360 1449.6707 1452.0549 1459.6231 1462.1916 1465.6279 1465.8485 1483.0435 1607.1118 2962.4153 2963.8981 2964.7215 2965.6751 2968.1392 2986.5771 2988.8891 2992.3854 2996.6898 3007.9779 3020.2535 3021.3841 3025.9796 3029.8480 3032.4763 3050.2996 3072.3194 3121.2843
redmass: 1.6547 2.2711 2.2629 3.3078 1.9589 2.4595 2.1348 4.3703 3.7029 4.5309 2.0134 1.7354 1.9453 2.4475 3.6318 2.5498 3.8327 3.8117 3.9790 3.9757 2.7367 2.7493 3.8275 1.6048 1.5724 1.5568 2.1987 2.0792 2.1388 2.0556 2.2619 2.1396 1.8408 1.8865 3.1197 1.7326 1.9159 1.5370 1.3140 1.3221 1.0411 1.0188 1.2230 1.3296 2.5644 1.4713 1.8742 1.7346 1.8330 1.8802 2.0342 1.5313 1.7247 1.3129 1.4605 1.4734 1.4096 1.5588 1.5575 1.2555 1.0778 1.0860 1.0815 1.0717 1.0897 1.0880 1.0737 1.0901 8.2707 1.0648 1.0619 1.0612 1.0589 1.0596 1.0688 1.0375 1.0824 1.0781 1.0801 1.1029 1.1034 1.1031 1.1021 1.1023 1.1019 1.0960 1.0999
irintensity: 3.1131 1.1114 0.0608 3.1761 0.0109 1.6583 0.0141 1.9029 0.1205 0.0273 0.4922 0.0135 0.5108 1.2936 12.8341 0.1183 0.0203 0.3797 0.2249 0.5523 2.2412 2.5592 1.8233 0.2039 0.0623 0.0642 5.7951 0.0283 3.2719 1.4906 8.3091 6.4092 3.1210 0.4784 6.1682 0.0441 0.8014 1.7505 2.0783 2.5524 0.4614 0.1526 0.2153 13.8985 90.1574 0.1557 9.0316 0.0494 0.3630 0.0028 0.3282 0.3703 0.2991 0.0004 2.3095 2.6489 2.4561 0.3837 2.6864 65.0292 22.3740 1.9224 0.1716 33.4982 14.8029 25.2809 5.4195 0.5682 125.9713 12.0960 28.2323 27.3849 2.3681 51.1094 40.5177 5.0754 155.0534 140.6085 31.7740 1.3555 2.1463 22.2756 102.7083 70.6803 40.1447 11.2772 14.7229
temp: 298.150 k
press: 1.00000 atm
elementType: 8 6 6 6 6 6 6 6 6 6 6 6 6 1 1 1 1 1 1 1 1 1 1 1 1 1 1 1 1 1 1
symmnumber: 1
zpe: 720308.3 jmol-1
zpe.correction: 0.274351 hartree
zpe.thermalcorrener: 0.284571 hartree
zpe.thermalcorrenthalpy: 0.285515 hartree
zpe.thermalcorrgfe: 0.239521 hartree
zpe.sumelectzpe: -542.304030 hartree
zpe.sumelectthermal: -542.293810 hartree
zpe.sumelectthermalent: -542.292866 hartree
zpe.sumelectthermalfe: -542.338861 hartree
dipole: 1.9797 -2.6578 0.0021
dipole: 3.3141
quadrupole: -85.2554 -81.6344 -77.5874
quadrupole: 8.5360 -0.0009 -0.0011
quadrupole: -3.7630 -0.1420 3.9050 8.5360 -0.0009 -0.0011
hfenergy: -542.5783813 hartree
pointgroup: C01 [X(C12H18O1)]
dipole: -0.8129733 1.0193813 0.0022328 debye
polarizability: 131.1142717|0.1840701|117.0246733|-0.0533936|0.0050517|106.6598708 unknown
InChI: InChI=1S/C12H18O/c1-8(13)12-5-9-2-10(6-12)4-11(3-9)7-12/h9-11H,2-7H2,1H3
charge 0 multiplicity 1
31 atoms
O  2.900978 -1.205838 -0.005534
C  0.744362 -0.04535 -0.003043
C  -1.390806 -1.440297 -0.003003
C  -1.329067 0.758439 -1.261607
C  -1.321977 0.74738 1.274219
C  0.158362 -1.485982 -0.007428
C  0.223712 0.72004 -1.267476
C  0.230752 0.709128 1.271158
C  -1.889522 -0.689263 -1.266934
C  -1.882371 -0.700353 1.270182
C  -1.821191 1.49944 0.010895
C  2.287687 -0.102415 -0.005769
C  3.076828 1.206685 -0.006479
H  -1.784639 -2.475682 -0.0064
H  -1.677315 1.297607 -2.165024
H  -1.665228 1.278739 2.184159
H  0.534779 -2.038866 0.873747
H  0.529872 -2.031402 -0.895377
H  0.587446 0.214482 -2.184311
H  0.615713 1.756184 -1.279702
H  0.622987 1.745094 1.290071
H  0.599717 0.195524 2.181386
H  -1.556543 -1.222214 -2.180109
H  -2.997511 -0.664855 -1.286154
H  -2.990232 -0.676201 1.295924
H  -1.544198 -1.241159 2.176807
H  -1.445028 2.542868 0.014394
H  -2.928096 1.551271 0.014223
H  2.829534 1.820947 -0.891743
H  2.838081 1.814969 0.885416
H  4.153914 0.979878 -0.011987
