program: Gaussian 09
title: 000123118
version: EM64L-G09RevD.01
frameworkgroup: C1[X(C2H5N3O)]
method: RPBEPBE
basis: SDD
operation: Freq
keyword: #pfreq=noraman
keyword: PBEPBE/SDD
title: #p freq=noraman PBEPBE/SDD
converged: YES YES NO NO
title: Mulliken charges:
elementType: O N N N C C H H H H H
charge: -0.443538 -0.096699 -0.002726 -0.050201 -0.368624 -0.298305 0.225978 0.250220 0.219230 0.208566 0.356099
chargesum: 0.00000
title: Mulliken charges with hydrogens summed into heavy atoms:
elementType: O N N N C C
charge: -0.087439 -0.096699 -0.002726 -0.050201 0.107574 0.129491
polarizability: 7.76484907e+01 -4.38442841e+00 3.61463435e+01 -2.87807459e+00 -5.17631520e-01 3.02898223e+01
1716.lowfreq: -9.4288 -5.5246 0.0006 0.0010 0.0011 11.9438 47.3944 114.6624 187.4775
frequency: 47.3882 114.6597 187.4769 292.5593 432.0409 477.4984 490.3972 573.9425 784.9732 857.9055 957.9694 1038.7972 1064.9193 1179.2559 1206.5864 1263.5415 1331.3027 1332.8477 1383.0329 1443.1283 1463.8550 2047.4222 2971.9272 2978.1489 3043.5414 3090.5217 3539.3564
redmass: 8.7076 4.4386 4.1106 2.5159 1.1453 4.1750 4.8937 8.3655 2.9213 2.4980 2.1587 3.1738 1.7019 1.1626 1.2486 11.6610 1.3253 1.1871 1.2389 1.0849 1.0859 13.2837 1.0564 1.0689 1.1049 1.0972 1.0655
irintensity: 0.4082 10.5999 2.8730 7.3951 202.0141 6.6160 8.7088 19.8453 4.3093 12.6653 38.8763 60.7203 11.3407 25.1454 27.4584 69.7547 9.7646 38.4922 27.5223 21.8052 5.2894 338.8007 32.9583 54.4046 42.8517 29.5686 8.9125
temp: 298.150 k
press: 1.00000 atm
elementType: 8 7 7 7 6 6 1 1 1 1 1
symmnumber: 1
zpe: 212905.4 jmol-1
zpe.correction: 0.081091 hartree
zpe.thermalcorrener: 0.087746 hartree
zpe.thermalcorrenthalpy: 0.088690 hartree
zpe.thermalcorrgfe: 0.049989 hartree
zpe.sumelectzpe: -318.132772 hartree
zpe.sumelectthermal: -318.126117 hartree
zpe.sumelectthermalent: -318.125173 hartree
zpe.sumelectthermalfe: -318.163873 hartree
dipole: -0.3834 2.0916 0.2263
dipole: 2.1385
quadrupole: -48.5438 -31.9872 -35.2516
quadrupole: -3.0578 -1.6311 -0.9673
quadrupole: -9.9496 6.6070 3.3426 -3.0578 -1.6311 -0.9673
hfenergy: -318.213863 hartree
pointgroup: C01 [X(C2H5N3O1)]
dipole: -0.1396295 0.8279665 0.0532619 debye
dipolederiv: -0.4827499 -0.1721159 0.1777344 -0.2766552 -0.7079086 -0.0850394 0.1778488 -0.073894 -0.4932583 -1.4572181 0.2054847 0.054289 -0.0320858 -0.1578169 -0.0750496 0.2611233 -0.1126845 -0.2273465 1.7139216 -0.0837448 -0.2123827 0.0268387 -0.0441383 0.0850578 -0.3283212 0.1102088 0.0607267 -0.9279204 0.0667773 0.0827175 0.0750884 -0.0926127 -0.0153627 0.0852529 -0.0156294 -0.0986043 0.5793222 -0.2828994 0.1542032 -0.2622001 0.3011164 0.031154 0.1752743 0.0423673 0.2826708 0.3575088 0.1082496 -0.030887 0.105384 0.5987819 0.1145653 -0.0785191 0.0645747 0.3868473 -0.0537117 -0.0673154 -0.0408192 0.0540204 -0.1690326 -0.0307859 -0.0585684 -0.0531496 0.0677027 -0.0278181 0.0445452 0.0194897 0.1079714 0.0519626 -0.0274128 -0.0579265 0.0392172 -0.1386149 -0.0339 0.0931349 -0.0511052 0.0626753 -0.0371473 0.0299753 -0.0710008 0.0688451 0.0648467 0.0689241 -0.0458238 -0.02061 -0.0503874 -0.0086926 -0.0406825 0.0392216 -0.0933196 -0.2053328 0.2636415 0.1337075 -0.1326298 0.1893503 0.2654883 0.0135804 -0.1443849 0.0234641 0.3003626 unknown
polarizability: 77.5514168|-5.0788776|36.2272369|-2.3481318|-0.7623451|30.3060028 unknown
InChI: InChI=1S/C2H5N3O/c3-5-4-1-2-6/h6H,1-2H2
charge 0 multiplicity 1
11 atoms
O  -2.330866 -0.850966 -0.1913
N  0.398813 -0.188883 0.327541
N  1.636621 -0.140165 0.072201
N  2.813862 -0.239235 -0.053794
C  -0.52007 0.833041 -0.292301
C  -1.925343 0.491055 0.22158
H  -0.228478 1.86003 0.00703
H  -0.487649 0.751008 -1.39604
H  -2.663568 1.17743 -0.224313
H  -1.952965 0.598132 1.325636
H  -1.639658 -1.485248 0.13366
