program: Gaussian 09
title: 000123116
version: EM64L-G09RevD.01
frameworkgroup: C1[X(C7H6F6O4)]
method: RPBEPBE
basis: SDD
operation: Freq
keyword: #pfreq=noraman
keyword: PBEPBE/SDD
title: #p freq=noraman PBEPBE/SDD
converged: YES YES NO NO
title: Mulliken charges:
elementType: F F F F F F O O O O C C C C C C C H H H H H H
charge: -0.131617 -0.131605 -0.139476 -0.150367 -0.139482 -0.150359 -0.232686 -0.232695 -0.173422 -0.173419 0.281856 0.212329 0.212323 0.206081 0.206107 -0.493275 -0.493277 0.252802 0.250571 0.258121 0.258119 0.252802 0.250571
chargesum: 0.00000
title: Mulliken charges with hydrogens summed into heavy atoms:
elementType: F F F F F F O O O O C C C C C C C
charge: -0.131617 -0.131605 -0.139476 -0.150367 -0.139482 -0.150359 -0.232686 -0.232695 -0.173422 -0.173419 0.281856 0.212329 0.212323 0.206081 0.206107 0.268219 0.268214
polarizability: 1.05738697e+02 2.68722362e-03 8.89705237e+01 -1.41619965e+01 8.58934993e-04 7.57446162e+01
1716.lowfreq: -7.1953 -5.2548 -0.0006 0.0006 0.0008 5.1351 22.8495 24.4385 47.7770
frequency: 22.6491 24.3761 47.7742 62.4039 72.3537 77.8540 84.4323 98.0520 133.5546 156.6460 159.5346 205.4920 206.2930 238.8114 252.9207 277.9795 280.0941 289.2874 298.6505 328.1733 332.6897 345.1058 365.5050 449.7659 462.7522 522.2163 552.5734 569.9780 679.9833 691.2899 738.3078 750.5825 855.4820 881.5743 903.6510 978.8986 1000.0479 1037.5483 1042.2297 1063.4422 1066.5774 1114.6084 1114.9791 1143.0949 1143.5429 1154.4830 1155.6810 1206.3549 1208.6800 1422.6834 1422.7196 1454.9466 1454.9615 1457.6998 1457.7369 1663.5220 1671.6701 3015.2459 3015.3141 3123.4530 3123.4716 3169.9720 3169.9958
redmass: 4.8110 6.4524 3.4787 2.7329 1.5336 1.5506 3.4089 5.7590 8.0704 5.5561 5.0863 6.8517 8.8766 15.1873 14.8265 8.5007 16.5589 6.2269 8.9013 9.9107 14.1029 16.8724 9.0281 16.1617 14.0541 14.9492 15.2245 14.8542 10.9915 11.7321 7.1724 6.8591 10.7127 9.6858 10.2158 11.1459 11.6809 13.1781 12.9301 9.8334 9.5895 1.2815 1.2736 5.7126 8.7959 1.4921 1.6576 9.6902 9.6847 1.1759 1.1751 1.0488 1.0488 1.0501 1.0502 10.8637 10.9397 1.0293 1.0293 1.1057 1.1057 1.1055 1.1055
irintensity: 5.9478 2.2228 0.5129 1.0490 0.4041 0.2244 0.3557 1.6387 0.0002 0.6791 2.0251 7.0715 0.5028 7.2249 0.1173 0.0116 3.3697 38.5372 0.6666 0.2218 2.7011 1.9334 4.7873 22.4709 1.6788 2.5464 17.5856 5.8211 41.0869 2.4842 18.2505 31.9588 93.8765 4.0419 37.2874 66.8872 54.9130 146.8094 81.4115 21.7389 308.5269 0.4800 0.1938 30.6685 49.1625 15.4157 0.7825 271.5574 10.8749 8.6598 16.9494 0.3569 36.5492 9.0347 14.1943 139.7048 233.3277 29.5338 4.8708 0.1188 31.7617 7.9085 7.2831
temp: 298.150 k
press: 1.00000 atm
elementType: 9 9 9 9 9 9 8 8 8 8 6 6 6 6 6 6 6 1 1 1 1 1 1
symmnumber: 1
zpe: 349742.3 jmol-1
zpe.correction: 0.133210 hartree
zpe.thermalcorrener: 0.151887 hartree
zpe.thermalcorrenthalpy: 0.152831 hartree
zpe.thermalcorrgfe: 0.084029 hartree
zpe.sumelectzpe: -1168.930083 hartree
zpe.sumelectthermal: -1168.911406 hartree
zpe.sumelectthermalent: -1168.910462 hartree
zpe.sumelectthermalfe: -1168.979264 hartree
dipole: -0.0002 -0.9535 -0.0008
dipole: 0.9535
quadrupole: -62.5344 -107.5751 -97.1001
quadrupole: 0.0057 -9.9877 -0.0017
quadrupole: 26.5355 -18.5052 -8.0302 0.0057 -9.9877 -0.0017
hfenergy: -1169.0632926 hartree
pointgroup: C01 [X(C7H6F6O4)]
dipole: 0.0000958 0.3751303 -0.000282 debye
dipolederiv: -0.4902756 0.138993 -0.1289271 0.2349418 -0.4606988 0.1726506 -0.1005372 0.1092925 -0.3756032 -0.4902288 -0.139059 -0.1288454 -0.2350078 -0.4608684 -0.1726452 -0.1004056 -0.1092519 -0.375452 -0.4339035 0.1036324 0.1236321 0.1050971 -0.4435863 -0.1500497 0.18669 -0.2236238 -0.4436682 -0.5736067 0.1483572 -0.0775969 0.1505176 -0.3430472 0.0760723 -0.1676251 0.1291305 -0.4075729 -0.433938 -0.1035772 0.1236746 -0.1050019 -0.44342 0.1500376 0.1867246 0.2236079 -0.4438046 -0.5735968 -0.1483724 -0.0775362 -0.1505724 -0.3431114 -0.0760915 -0.1675695 -0.1291571 -0.4074676 -1.1055397 0.0758478 -0.4555298 0.1423842 -0.4893989 0.1066819 -0.4963849 0.0607711 -0.5267978 -1.1054384 -0.0759897 -0.455595 -0.1425263 -0.489482 -0.1068187 -0.496335 -0.060857 -0.5268575 -0.5023137 -0.0959065 -0.0982368 0.2173645 -0.749163 0.2304492 -0.141541 0.0039551 -0.3360312 -0.5022139 0.0960015 -0.0982044 -0.2173201 -0.7492375 -0.2303756 -0.1415831 -0.0039722 -0.3360672 0.9697553 0.0001015 0.3231882 0.0000381 0.8957648 -0.0000256 -0.0109132 -0.0000497 0.6901412 0.937944 -0.3089009 -0.081317 -0.2804982 0.6806835 0.0182992 -0.0024733 0.1474357 0.8679617 0.9380175 0.3088146 -0.0814479 0.2804896 0.6805869 -0.0182318 -0.0026285 -0.1473512 0.8679476 1.07136 -0.0641188 0.4142699 -0.3662884 1.0180972 -0.4000503 0.5739267 -0.088317 0.4605159 1.0711227 0.0641145 0.4142626 0.3663112 1.0182995 0.4000581 0.5739346 0.0883587 0.4606389 0.5867491 0.0582462 0.1549575 0.1366418 0.2221331 0.0706898 0.1735304 0.0272654 0.3551657 0.5867722 -0.0581721 0.1549909 -0.136551 0.2220895 -0.0706483 0.1735741 -0.0272276 0.3551968 0.003367 -0.0393886 -0.0010509 -0.1127383 0.0563182 0.0299233 0.054007 0.0678249 -0.0312579 0.0263991 0.0406229 -0.0643085 0.0792085 0.0207154 0.0593107 -0.0745765 0.0357317 0.0821186 -0.0051006 0.0547607 0.0524896 -0.0140646 0.0401513 -0.1058647 0.0003779 -0.0629431 0.0100195 -0.0050903 -0.0547676 0.0524732 0.0140534 0.0401549 0.1058789 0.0003595 0.0629405 0.0100055 0.0033254 0.0393833 -0.0010459 0.1127314 0.0563404 -0.0299242 0.0540095 -0.0678191 -0.0312494 0.0264337 -0.040623 -0.0642969 -0.0792103 0.0206789 -0.059326 -0.0745614 -0.0357444 0.0821181 unknown
polarizability: 105.4670838|0.0006992|88.9705237|14.4442083|0.0005874|76.016229 unknown
InChI: InChI=1S/C7H6F6O4/c1-16-3(14)5(8,9)7(12,13)6(10,11)4(15)17-2/h1-2H3
charge 0 multiplicity 1
23 atoms
F  0.853472 -1.986214 0.752576
F  -0.853355 -1.986713 -0.75155
F  1.536309 -1.213471 -1.860563
F  -0.05206 0.431625 -1.810543
F  -1.536395 -1.212671 1.861088
F  0.051998 0.432385 1.810417
O  2.876695 -0.003863 0.241736
O  -2.876593 -0.003955 -0.241926
O  1.820888 1.931989 -0.542667
O  -1.821289 1.932194 0.542413
C  0.000002 -1.145203 0.000286
C  0.863878 -0.303333 -1.005714
C  -0.863921 -0.302892 1.005872
C  1.896146 0.70037 -0.406924
C  -1.896196 0.700556 0.406664
C  3.94936 0.809759 0.879819
C  -3.949406 0.809365 -0.880139
H  4.486421 1.386133 0.108994
H  4.603668 0.070611 1.35897
H  3.502655 1.494287 1.619104
H  -3.502815 1.493929 -1.619459
H  -4.486641 1.385683 -0.109393
H  -4.60352 0.070027 -1.35926
