program: Gaussian 09
title: 000123084
version: EM64L-G09RevD.01
frameworkgroup: C1[X(C5H4FNO)]
method: RPBEPBE
basis: SDD
operation: Freq
keyword: #p
keyword: freq=noraman
keyword: PBEPBE/SDD
title: #p freq=noraman PBEPBE/SDD
converged: NO NO YES YES
title: Mulliken charges:
elementType: F O N C C C C C H H H H
charge: -0.184950 -0.332514 0.049205 -0.303586 0.335662 -0.207021 -0.325923 -0.141287 0.305784 0.286248 0.274436 0.243947
chargesum: 0.00000
title: Mulliken charges with hydrogens summed into heavy atoms:
elementType: F O N C C C C C
charge: -0.184950 -0.332514 0.049205 0.002198 0.335662 0.079227 -0.051487 0.102660
polarizability: 9.03075790e+01 -9.44816629e+00 7.57400383e+01 -1.77603357e-03 8.81439391e-04 2.53474724e+01
1716.lowfreq: -0.0011 -0.0003 0.0008 6.0062 6.0254 9.5268 201.3799 228.3538 323.0796
frequency: 201.3795 228.3522 323.0796 447.4159 487.8143 502.9292 531.8263 594.7009 660.2201 732.2856 761.8275 831.2359 850.3491 948.3077 948.6122 992.8884 1071.6308 1135.9193 1164.1059 1267.8100 1274.6407 1288.7684 1420.6999 1476.4911 1536.3492 1618.7604 3171.5470 3202.0130 3219.6286 3225.7511
redmass: 5.6822 5.5501 11.8482 3.0273 5.4135 8.6459 8.7699 4.9757 2.1912 8.1336 1.3365 1.6490 1.4282 3.0766 1.2944 6.2108 1.5721 1.8700 1.3208 3.8118 2.8581 2.1906 2.2200 3.6094 6.0976 6.5935 1.0897 1.0957 1.0964 1.0955
irintensity: 2.6696 0.0578 6.2573 4.6400 2.0194 8.4580 6.1764 0.1912 27.9962 2.8834 54.8996 71.5840 1.0046 30.1826 0.7200 26.4075 3.4426 94.3990 2.7156 41.7507 3.0425 13.3143 44.8935 39.3673 93.3450 78.3185 4.8364 0.2041 0.7128 5.3240
temp: 298.150 k
press: 1.00000 atm
elementType: 9 8 7 6 6 6 6 6 1 1 1 1
symmnumber: 1
zpe: 216029.7 jmol-1
zpe.correction: 0.082281 hartree
zpe.thermalcorrener: 0.088376 hartree
zpe.thermalcorrenthalpy: 0.089320 hartree
zpe.thermalcorrgfe: 0.052022 hartree
zpe.sumelectzpe: -422.109464 hartree
zpe.sumelectthermal: -422.103369 hartree
zpe.sumelectthermalent: -422.102425 hartree
zpe.sumelectthermalfe: -422.139723 hartree
dipole: -1.6777 3.1803 0.0001
dipole: 3.5957
quadrupole: -54.1713 -39.5232 -46.9774
quadrupole: 3.0657 0.0003 0.0000
quadrupole: -7.2807 7.3675 -0.0868 3.0657 0.0003 0.0000
hfenergy: -422.1917451 hartree
pointgroup: C01 [X(C5H4F1N1O1)]
dipole: 0.681366 -1.2397476 0.0000497 debye
dipolederiv: -0.8515174 -0.3479962 -0.0000166 -0.3995913 -0.4159203 -0.0000088 -0.0000187 -0.0000095 -0.1492836 -0.9162646 0.3367638 -0.0000217 0.3619666 -0.5373896 0.0000129 -0.0000223 0.0000134 -0.3196363 0.9557732 -0.3927835 0.0000347 -0.4509085 0.4753417 -0.00002 0.0000402 -0.0000234 0.1261227 -0.5060439 0.0839597 -0.000013 -0.0788396 0.0109387 0.0000002 -0.0000119 0.0000068 -0.1573158 1.0953049 0.2644871 0.0000237 0.3913049 0.6719421 0.0000069 0.000026 0.0000047 0.1627485 -0.0409038 0.0437466 -0.0000022 0.3684523 -0.230787 0.0000092 -0.0000099 0.0000026 -0.1607262 -0.2591673 -0.0200355 0.0000002 -0.18566 -0.3199975 -0.0000056 0.0000077 -0.0000066 -0.2040136 0.276983 0.0083434 0.0000071 -0.0356283 0.1563008 -0.0000011 0.0000083 0.0000044 -0.0777287 0.0804746 0.0240892 -0.0000033 -0.0101556 0.0814985 -0.0000004 -0.0000058 0.0000009 0.2151165 0.0342917 -0.0281606 -0.0000024 0.0120624 0.075289 0.0000023 -0.0000048 0.0000027 0.2013545 0.0210403 0.0375847 -0.0000062 0.0424496 0.0855914 0.0000032 -0.0000092 0.0000051 0.2036161 0.1100292 -0.0099987 -0.0000006 -0.0154525 -0.0528078 0.0000011 0.0000004 -0.0000011 0.1597458 unknown
polarizability: 90.6263997|-9.193572|75.4212176|0.0017908|-0.0008509|25.3474724 unknown
InChI: InChI=1S/C5H4FNO/c6-5-2-1-3-7(8)4-5/h1-4H
charge 0 multiplicity 1
12 atoms
F  2.388335 1.049437 0.00005
O  -2.366136 1.055358 -0.000092
N  -1.223918 0.377955 -0.000042
C  -0.00181 1.053902 -0.000014
C  1.189432 0.324474 0.000019
C  -1.222764 -1.021627 -0.000018
C  1.232541 -1.08231 0.000031
C  -0.021728 -1.739016 0.000016
H  -0.055537 2.142283 -0.000013
H  -2.216566 -1.46955 -0.000027
H  2.182527 -1.619583 0.000069
H  -0.073375 -2.831224 0.00002
