program: Gaussian 09
title: 000123080
version: EM64L-G09RevD.01
frameworkgroup: C1[X(C17H14O)]
method: RPBEPBE
basis: SDD
operation: Freq
keyword: #pfreq=noraman
keyword: PBEPBE/SDD
title: #p freq=noraman PBEPBE/SDD
converged: NO NO NO NO
title: Mulliken charges:
elementType: O C C C C C C C C C C C C C C C C C H H H H H H H H H H H H H H
charge: -0.258705 0.391428 0.389187 0.350784 -0.577965 -0.426321 -0.457731 -0.355884 0.475303 -0.411902 -0.409823 -0.241973 -0.250333 -0.388775 -0.388675 -0.227419 -0.227372 -0.230900 0.259657 0.233056 0.210043 0.210281 0.251829 0.237888 0.236512 0.225764 0.226080 0.234629 0.234669 0.228194 0.228182 0.230290
chargesum: 0.00000
title: Mulliken charges with hydrogens summed into heavy atoms:
elementType: O C C C C C C C C C C C C C C C C C
charge: -0.258705 0.391428 0.389187 0.350784 -0.318308 -0.193264 -0.037406 -0.104055 0.475303 -0.174013 -0.173310 -0.016209 -0.024253 -0.154146 -0.154007 0.000775 0.000810 -0.000610
polarizability: 3.10686346e+02 1.44902536e+00 1.56055425e+02 2.80586252e-01 -4.41954934e-02 1.17436849e+02
1716.lowfreq: -9.2335 -7.6983 -0.0010 -0.0007 -0.0006 8.1537 15.2390 29.1811 51.0367
frequency: 8.7809 28.3380 50.9696 67.0954 129.7953 143.2370 187.0720 214.8454 291.8655 304.6744 342.1652 400.9867 402.9680 405.3622 475.7491 490.2958 503.8280 521.3589 531.3945 594.9172 617.7100 622.4117 647.1918 698.5426 713.2525 754.8393 756.3993 765.3875 776.6437 812.7765 836.9032 853.1668 861.7021 864.7494 901.2706 923.9196 938.9711 945.3948 966.7039 974.9727 976.4665 980.3990 988.2833 990.7429 997.7193 1020.7274 1026.7184 1090.2793 1120.8434 1161.0985 1165.0745 1172.7896 1173.2663 1187.5386 1194.4975 1226.3478 1240.4787 1256.0212 1271.8859 1325.9249 1350.2036 1361.4782 1386.7789 1409.8537 1419.2346 1438.7533 1440.9770 1461.7894 1481.4173 1487.2100 1513.2812 1575.7481 1597.2200 1604.2322 1617.2362 1642.8086 2949.3105 3007.1777 3116.5746 3120.7502 3122.2802 3122.9545 3123.8830 3134.7387 3139.9251 3147.8725 3150.4266 3158.1793 3159.4772 3163.6189
redmass: 3.7416 5.5910 5.2076 3.7634 5.6568 5.6275 3.7167 5.3066 4.5434 4.7525 2.4195 4.7409 2.8017 3.1788 2.4666 6.3321 4.0506 5.4301 3.4775 5.7444 6.3458 6.2140 2.7704 2.6948 2.3281 4.3886 1.3189 2.4097 2.3887 1.4401 3.7656 1.2473 1.4517 4.6118 1.7284 1.9247 3.1592 1.3574 1.4207 4.5122 1.3930 1.5588 1.3359 5.7124 1.3508 2.2651 2.1805 1.5018 1.8016 1.3223 1.4878 1.1146 1.0542 1.1187 1.0887 2.4348 2.3047 1.9326 1.7401 1.2707 1.5504 1.6162 8.4429 4.6811 3.5148 3.7299 2.1857 2.3742 1.1740 2.2409 3.5424 7.5192 6.1244 5.6504 6.2106 6.9471 1.0556 1.1071 1.0857 1.0852 1.0888 1.0883 1.0881 1.0921 1.0951 1.0964 1.0919 1.0965 1.0988 1.1017
irintensity: 0.0075 0.7116 0.1975 1.8863 0.3885 0.8697 1.2629 0.3356 1.9147 1.2443 0.4543 0.6967 0.0062 0.0278 24.8084 0.4143 9.9004 4.4423 0.0867 6.2930 0.1241 8.1779 0.3042 28.9822 46.9627 13.1324 39.6759 42.5590 3.3253 53.0719 25.8146 0.1106 35.3132 1.0174 20.0118 20.2209 1.8116 0.0017 10.4001 151.9899 0.0373 1.3747 0.0830 0.4116 0.2330 2.8458 5.2226 7.0408 57.8071 132.4127 81.0309 8.0194 0.0028 0.2202 1.1074 12.3042 64.7809 198.8240 6.8644 0.2900 36.4125 14.6594 0.4491 0.0875 3.9296 4.1255 9.2425 52.6273 14.1035 3.2681 83.3092 5.9340 0.6466 58.6484 0.0887 103.1759 49.1349 28.2263 3.1347 5.0504 3.5055 1.9560 9.7485 16.6055 34.3387 39.8376 6.6149 45.7658 13.4927 22.7279
temp: 298.150 k
press: 1.00000 atm
elementType: 8 6 6 6 6 6 6 6 6 6 6 6 6 6 6 6 6 6 1 1 1 1 1 1 1 1 1 1 1 1 1 1
symmnumber: 1
zpe: 671709.8 jmol-1
zpe.correction: 0.255841 hartree
zpe.thermalcorrener: 0.270165 hartree
zpe.thermalcorrenthalpy: 0.271110 hartree
zpe.thermalcorrgfe: 0.211535 hartree
zpe.sumelectzpe: -730.192663 hartree
zpe.sumelectthermal: -730.178338 hartree
zpe.sumelectthermalent: -730.177394 hartree
zpe.sumelectthermalfe: -730.236968 hartree
dipole: -1.2361 1.3433 0.0152
dipole: 1.8256
quadrupole: -89.4157 -97.5407 -104.3796
quadrupole: 1.7019 0.0360 -0.0244
quadrupole: 7.6963 -0.4287 -7.2676 1.7019 0.0360 -0.0244
hfenergy: -730.4485034 hartree
pointgroup: C01 [X(C17H14O1)]
dipole: 0.4907876 0.5243887 0.0012444 debye
polarizability: 310.6508783|-2.7612376|156.0821797|0.174694|0.587526|117.4455615 unknown
InChI: InChI=1S/C17H14O/c1-2-6-14(7-3-1)13-18-17-11-10-15-8-4-5-9-16(15)12-17/h1-12H,13H2
charge 0 multiplicity 1
32 atoms
O  0.899896 -0.117447 0.006328
C  -2.771162 -0.625723 -0.004485
C  -3.272889 0.737791 0.007355
C  -0.463887 0.221344 0.006697
C  -1.361529 -0.853879 -0.004501
C  -2.326115 1.811418 0.018917
C  1.883594 0.987163 0.010028
C  -0.950256 1.572408 0.018847
C  3.267274 0.377253 0.00107
C  -3.717712 -1.707475 -0.015934
C  -4.689522 0.962783 0.007322
C  -5.090712 -1.455542 -0.015668
C  -5.583913 -0.109445 -0.003933
C  3.927077 0.076292 1.218676
C  3.917447 0.089139 -1.224837
C  5.21455 -0.505506 1.212865
C  5.204905 -0.49266 -1.235247
C  5.856744 -0.789678 -0.015256
H  -0.964114 -1.874271 -0.013431
H  -2.695551 2.844151 0.028374
H  1.732091 1.610223 0.915991
H  1.725365 1.62252 -0.88615
H  -0.25446 2.416795 0.028923
H  -3.344086 -2.738495 -0.024938
H  -5.061981 1.994668 0.016373
H  -5.800559 -2.290596 -0.024462
H  -6.664334 0.072571 -0.003827
H  3.427014 0.290995 2.171097
H  3.409918 0.313869 -2.170971
H  5.715517 -0.734857 2.16004
H  5.698415 -0.711949 -2.1887
H  6.856977 -1.23776 -0.021566
