program: Gaussian 09
title: 000123079
version: EM64L-G09RevD.01
frameworkgroup: C1[X(C12H10O2)]
method: RPBEPBE
basis: SDD
operation: Freq
keyword: #pfreq=noraman
keyword: PBEPBE/SDD
title: #p freq=noraman PBEPBE/SDD
converged: NO YES NO NO
title: Mulliken charges:
elementType: O O C C C C C C C C C C C C H H H H H H H H H H
charge: -0.420829 -0.437061 0.139331 0.322017 0.154762 -0.342897 -0.343511 -0.345404 -0.382308 -0.342114 -0.390865 -0.251598 0.281601 -0.207500 0.239127 0.240983 0.246600 0.216702 0.248625 0.216453 0.228220 0.226685 0.351457 0.351524
chargesum: 0.00000
title: Mulliken charges with hydrogens summed into heavy atoms:
elementType: O O C C C C C C C C C C C C
charge: -0.069373 -0.085537 0.139331 0.322017 0.154762 -0.103770 -0.102528 -0.098804 -0.165605 -0.093489 -0.174412 -0.023378 0.281601 0.019186
polarizability: 1.95156086e+02 4.68358756e+00 1.06491174e+02 -2.05509129e+00 -1.78131136e-01 9.67427499e+01
1716.lowfreq: -50.4526 -9.3624 -5.0311 -0.0008 -0.0006 -0.0005 7.9152 59.4240 73.9754
frequency: -50.4410 59.4225 73.9713 176.1168 185.0929 251.1034 310.3765 354.7304 356.6790 361.6615 388.9083 404.9686 446.7259 475.3885 512.8503 555.0186 559.1205 573.0829 632.9450 680.1092 727.5555 742.7582 752.4682 794.0189 804.1142 816.5598 832.9407 841.2248 930.9290 932.8693 958.9795 970.8901 989.5187 1013.7413 1041.1929 1084.1003 1098.5017 1142.7567 1151.7922 1170.0113 1178.6091 1241.2119 1243.1255 1278.4089 1292.8677 1303.4450 1375.2293 1382.0954 1415.4733 1428.4660 1483.2883 1513.1223 1591.3846 1594.2003 1612.1643 1627.3116 3108.4745 3110.0588 3131.5904 3138.5194 3143.7577 3147.6850 3165.6655 3170.5406 3571.0042 3579.0465
redmass: 4.0162 6.0706 4.8261 6.1588 4.9740 6.5766 3.9366 2.5791 1.4866 1.1370 3.7285 2.9306 4.1373 3.2673 4.6215 3.3479 3.7929 6.5625 6.4119 5.7288 3.8968 2.6642 1.5128 5.2707 1.4391 5.3486 1.5579 1.4390 1.3543 1.3682 1.3529 1.3108 6.4662 2.6911 2.0966 1.8976 1.4246 1.3567 1.2395 1.0551 1.1120 2.5372 2.3863 2.1088 1.7774 1.4222 4.5933 6.8332 3.2573 2.3475 2.4681 3.2411 6.4975 6.4644 6.7319 6.6612 1.0885 1.0888 1.0871 1.0895 1.0937 1.0953 1.1005 1.0961 1.0659 1.0659
irintensity: 0.7586 1.0682 2.3747 0.4166 0.3846 0.2194 9.6905 52.9044 93.6743 116.3386 12.3714 0.7048 0.9515 13.5168 11.4843 37.5332 0.2015 8.5099 1.4406 0.5354 0.7326 16.6030 79.6374 39.5295 21.3990 18.0225 26.0182 0.2903 0.2418 1.2043 0.2441 0.0136 13.3666 0.3229 12.4538 97.6090 50.2049 214.6169 75.0867 1.4652 12.7351 12.2448 26.2955 83.8580 3.4021 5.4831 22.2444 5.5942 7.8858 37.3307 92.6589 33.9240 10.4961 20.3446 14.8342 28.4381 14.8733 21.8776 1.4717 10.7321 24.8010 11.5723 25.7967 6.7214 28.1742 37.9372
temp: 298.150 k
press: 1.00000 atm
elementType: 8 8 6 6 6 6 6 6 6 6 6 6 6 6 1 1 1 1 1 1 1 1 1 1
symmnumber: 1
zpe: 484379.6 jmol-1
zpe.correction: 0.184490 hartree
zpe.thermalcorrener: 0.195407 hartree
zpe.thermalcorrenthalpy: 0.196351 hartree
zpe.thermalcorrgfe: 0.147733 hartree
zpe.sumelectzpe: -612.736237 hartree
zpe.sumelectthermal: -612.725321 hartree
zpe.sumelectthermalent: -612.724376 hartree
zpe.sumelectthermalfe: -612.772994 hartree
dipole: -1.6521 0.7255 -1.5676
dipole: 2.3902
quadrupole: -69.2111 -75.3112 -77.9029
quadrupole: -4.9000 -8.9378 -0.0031
quadrupole: 4.9307 -1.1695 -3.7612 -4.9000 -8.9378 -0.0031
hfenergy: -612.9207278 hartree
pointgroup: C01 [X(C12H10O2)]
dipole: -0.6526981 0.2827029 -0.6151405 debye
dipolederiv: -0.2523793 -0.4970609 -0.0017 -0.3905171 -1.1275041 0.003113 -0.0013244 0.0062986 -0.3633665 -1.6194747 -0.0254484 0.0345423 -0.0284997 -0.4248225 -0.0026664 0.0152484 -0.0032414 -0.0648883 0.3814345 0.0895555 -0.0049513 -0.2101505 -0.2139903 0.0020232 -0.0007871 -0.0007458 -0.1114901 0.222737 -0.0307915 0.0077331 -0.0323584 -0.0802803 0.0013815 -0.0281913 0.0001494 -0.1392662 0.1417408 0.4321057 0.0008398 0.3535611 1.08052 -0.0021209 -0.0001526 -0.004133 0.0701683 0.0109766 0.005559 -0.0836505 -0.003859 -0.0905406 -0.0239792 -0.0233555 -0.0002934 0.136801 0.0365603 0.0057621 0.0554923 -0.0044543 -0.1004613 0.0209761 0.0443565 -0.0008772 0.1487033 0.0143072 -0.0256359 0.0008031 0.0971523 0.1236652 -0.0019556 0.0001182 -0.0012366 -0.1151894 -0.3628627 0.0001177 0.0307491 0.0061224 -0.2040985 0.0000554 -0.2757526 -0.0063143 0.0046956 -0.3256198 0.0002706 -0.0076452 0.0040547 -0.1711872 -0.0006536 0.2686948 0.005002 0.0212814 -0.1486626 -0.3211885 0.0002568 0.0281213 -0.122531 -0.0011625 -0.0009194 0.0023193 -0.1998343 -0.2218204 0.0637866 0.0005864 0.0963899 -0.0251251 -0.0007491 -0.0004226 -0.0010707 -0.1926825 1.5251703 0.0329741 -0.0610872 0.0385046 0.0727563 -0.0011379 -0.0590686 -0.0008506 0.0700912 0.0980141 0.0386495 -0.0012389 -0.1222683 0.1255426 0.0006189 -0.0013934 -0.0006336 -0.1407623 0.0546344 -0.0045221 -0.092709 -0.0041433 0.1304629 0.0013088 -0.0968887 -0.0005735 -0.0399673 0.0595319 -0.0049044 0.095306 -0.0044644 0.1295806 0.0002034 0.0946701 0.0015204 -0.0412415 0.0538432 0.1003123 -0.0001851 0.1024292 -0.0262907 -0.0005457 0.0002569 -0.0000241 0.1323983 -0.0513221 -0.0046825 0.1120039 -0.0076753 0.1690811 0.0036258 0.110521 0.002668 -0.0520503 0.0195759 -0.0024021 -0.0769503 -0.0050155 0.1677999 -0.0013745 -0.0833675 -0.0010086 -0.0193481 0.0130506 0.0624813 0.0010924 0.1023567 -0.1074316 -0.0002924 0.0007151 0.0001602 0.16764 0.0080541 -0.0811808 0.0014375 -0.10221 -0.0793518 0.0011965 0.0011914 0.0009765 0.1676344 -0.1436116 -0.0132767 0.0019501 -0.0038694 0.0870339 0.000131 0.0017431 0.0000807 0.1585789 0.0713923 0.1793304 0.0029526 0.091692 0.3083002 -0.0006019 0.0027495 -0.0021042 0.358012 0.4147299 0.0001889 -0.0156277 -0.0008991 0.3788724 0.0026061 0.0313587 0.003932 0.0440826 unknown
polarizability: 195.1611349|4.3249023|106.4530586|-2.698542|-0.2785919|96.7758165 unknown
InChI: InChI=1S/C12H10O2/c13-10-7-5-9(6-8-10)11-3-1-2-4-12(11)14/h1-8,13-14H
charge 0 multiplicity 1
24 atoms
O  -1.15076 2.204733 -0.009243
O  4.695146 -0.027487 0.050017
C  -1.050123 -0.203809 -0.004783
C  0.449352 -0.140357 -0.010712
C  -1.840904 0.979039 -0.002618
C  1.169845 -0.115738 -1.230773
C  1.181973 -0.122881 1.204995
C  -1.727178 -1.448166 0.001279
C  2.581051 -0.079193 -1.243459
C  2.590836 -0.086683 1.209803
C  -3.255699 0.915096 0.005621
C  -3.139077 -1.528237 0.009186
C  3.289768 -0.064198 -0.018239
C  -3.902786 -0.339441 0.011488
H  0.621903 -0.122783 -2.179447
H  0.64147 -0.135603 2.158032
H  -1.125375 -2.364178 0.000637
H  3.12261 -0.061092 -2.198862
H  3.158663 -0.073567 2.14484
H  -3.846847 1.841023 0.007549
H  -3.634156 -2.504733 0.014055
H  -4.997516 -0.383727 0.017985
H  -1.787155 2.962953 -0.002622
H  5.089559 -0.008072 -0.857227
