program: Gaussian 09
title: 000123075
version: EM64L-G09RevD.01
frameworkgroup: C1[X(C7H5N3O6)]
method: RPBEPBE
basis: SDD
operation: Freq
keyword: #pfreq=noraman
keyword: PBEPBE/SDD
title: #p freq=noraman PBEPBE/SDD
converged: NO YES NO NO
title: Mulliken charges:
elementType: O O O O O O N N N C C C C C C C H H H H H
charge: -0.138819 -0.138856 -0.139122 -0.139103 -0.182794 -0.181076 -0.019076 -0.020980 0.019769 0.457872 0.116540 0.376057 -0.589527 0.466526 -0.506673 -0.782631 0.307264 0.322922 0.263087 0.263177 0.245443
chargesum: 0.00000
title: Mulliken charges with hydrogens summed into heavy atoms:
elementType: O O O O O O N N N C C C C C C C
charge: -0.138819 -0.138856 -0.139122 -0.139103 -0.182794 -0.181076 -0.019076 -0.020980 0.019769 0.457872 0.116540 0.376057 -0.282263 0.466526 -0.183752 -0.010924
polarizability: 1.65177815e+02 -7.84793859e-01 1.33083307e+02 -2.40428336e-02 3.56849328e-02 8.19219787e+01
1716.lowfreq: -76.5479 -47.3434 -10.3063 -8.7552 -3.4382 -0.0013 -0.0012 -0.0010 51.9113
frequency: -76.5475 -47.3253 51.9011 61.6130 79.6098 105.1375 119.6834 148.3220 196.0185 201.5896 217.5406 275.4691 316.4539 318.7352 375.0870 454.1931 475.2350 505.7476 554.0394 554.8170 596.3173 659.1027 681.0847 710.1256 717.0646 731.9013 732.8935 766.7744 879.9311 920.7353 932.9315 936.6776 1012.2954 1054.8019 1068.8849 1114.2774 1193.5394 1210.5614 1235.5029 1242.6277 1270.6925 1380.7845 1381.2244 1383.2042 1402.3704 1408.1060 1426.8593 1443.5943 1468.5826 1480.0540 1590.1140 1614.0369 2993.7207 3073.3118 3116.7884 3180.1751 3186.8243
redmass: 12.5888 10.7670 15.2980 5.9513 1.2140 5.2019 15.2810 12.4435 8.7051 3.5755 3.8586 13.7142 10.3219 6.9287 6.0251 5.5552 5.8803 8.3039 5.7127 4.4509 5.6313 13.3701 12.9674 6.1053 7.4428 12.5454 6.2419 10.4272 10.0111 1.3828 1.4365 6.5854 1.6496 1.5336 3.0085 2.0283 3.2337 9.0064 2.1777 11.5756 5.9277 10.6086 13.3223 4.4204 13.1507 1.2837 4.2545 4.6125 1.0571 1.1465 6.7574 9.1590 1.0384 1.0978 1.0991 1.0927 1.0939
irintensity: 0.0476 0.0106 0.0013 4.3483 0.0033 2.1800 0.8528 8.0250 0.7855 1.1052 0.4030 0.8240 4.1924 0.1197 4.5573 4.4680 5.9359 8.6297 5.1521 2.4149 2.0742 1.4690 23.2374 10.6345 10.1316 15.7873 0.8042 40.0609 10.5011 6.7410 29.6907 1.5963 0.0565 8.3264 33.3925 6.8404 5.8698 281.0695 58.8938 64.8679 17.3873 101.9938 5.4956 3.7995 289.5626 28.1016 7.2418 33.2220 9.9928 22.2977 3.4138 8.8898 3.6367 3.3557 7.6102 5.6958 17.2433
temp: 298.150 k
press: 1.00000 atm
elementType: 8 8 8 8 8 8 7 7 7 6 6 6 6 6 6 6 1 1 1 1 1
symmnumber: 1
zpe: 336208.5 jmol-1
zpe.correction: 0.128055 hartree
zpe.thermalcorrener: 0.141091 hartree
zpe.thermalcorrenthalpy: 0.142035 hartree
zpe.thermalcorrgfe: 0.087230 hartree
zpe.sumelectzpe: -883.906354 hartree
zpe.sumelectthermal: -883.893318 hartree
zpe.sumelectthermalent: -883.892374 hartree
zpe.sumelectthermalfe: -883.947180 hartree
dipole: 1.0670 3.9816 -0.0002
dipole: 4.1221
quadrupole: -119.7176 -85.6328 -95.7530
quadrupole: -2.2872 0.0064 -0.0113
quadrupole: -19.3498 14.7350 4.6148 -2.2872 0.0064 -0.0113
hfenergy: -884.0344092 hartree
pointgroup: C01 [X(C7H5N3O6)]
dipole: -0.4465987 1.5590489 0.0000934 debye
dipolederiv: -0.5591077 -0.0893113 0.1612635 -0.0936876 -0.1824377 0.0594949 0.0200547 0.0052143 -0.5978676 -0.5594291 -0.0888428 -0.1615498 -0.0933499 -0.1821544 -0.05837 -0.0205049 -0.0042019 -0.5979877 -0.3171756 0.2157139 0.0931599 0.210316 -0.4207937 -0.1461261 0.0090048 -0.0038998 -0.617148 -0.3163455 0.2156413 -0.0913854 0.209992 -0.4216522 0.1474828 -0.0074286 0.0051441 -0.6169817 -0.7653854 0.1744199 0.000051 0.1330408 -0.5823522 -0.0001078 0.0000045 -0.0000102 -0.2070206 -0.6445855 -0.1769161 -0.0000232 -0.1672054 -0.692065 -0.0000788 -0.000047 -0.0001212 -0.2045417 0.973266 0.1953388 0.0003232 0.1869788 0.1228903 -0.0012287 0.000431 -0.0010234 1.1355359 0.4528117 -0.5390279 -0.0019843 -0.5057544 0.693776 -0.0016209 -0.0016267 -0.0014003 1.1814994 1.7539025 0.1007334 0.0000144 0.1369273 1.0703082 0.000188 -0.0000176 0.0001022 0.1797978 -0.1887683 0.2016085 0.0000436 0.1907029 0.401561 0.0000316 0.0002842 -0.0000492 0.0312233 0.2385321 0.099657 -0.0000276 -0.0222427 0.073562 0.0001761 0.0002637 -0.0003271 -0.0705113 0.0325336 -0.1295348 0.000218 -0.0765329 0.1522836 0.0001968 -0.0001846 0.0001593 -0.0179432 0.0695975 -0.2138083 -0.0000242 0.2282462 -0.1690462 -0.0000277 0.0000553 0.0000249 -0.115783 -0.5359356 -0.1054439 -0.0000606 -0.1791699 0.1546664 0.0000427 0.0000097 -0.0000033 0.109833 0.040853 0.1842666 0.0000325 -0.1156395 -0.2192016 -0.0000477 -0.0003008 0.0003187 -0.080469 -0.0597844 -0.1573805 -0.0000383 -0.0926288 -0.143866 0.000052 0.0000341 0.0002844 0.0035677 0.1222825 0.042449 0.0000005 0.0194663 0.0845945 -0.0000124 -0.0000313 -0.0000521 0.1662821 0.1440177 -0.0137095 -0.0000331 0.015513 0.117415 0.000002 0.0000963 -0.0000086 0.1711427 0.0713357 -0.0232188 -0.0895688 -0.0138017 0.0598991 0.0267813 -0.079542 -0.0303389 0.0086592 0.0715813 -0.0232307 0.0894922 -0.0138518 0.0599073 -0.0267677 0.0793859 0.0303096 0.0085951 -0.0241964 0.1305963 0.0000965 0.0426811 0.0227059 -0.0000606 0.0000592 -0.0001216 0.1301175 unknown
polarizability: 165.1414832|1.3344093|133.1196394|-0.0234276|-0.0360918|81.9219787 unknown
InChI: InChI=1S/C7H5N3O6/c1-4-2-5(8(11)12)3-6(9(13)14)7(4)10(15)16/h2-3H,1H3
charge 0 multiplicity 1
21 atoms
O  2.936849 0.947872 -1.145061
O  2.937465 0.945193 1.145083
O  1.772361 -2.368421 -1.145834
O  1.768217 -2.371997 1.145785
O  -4.073157 0.774906 0.000244
O  -3.661154 -1.46977 -0.000101
N  2.368289 0.817587 0.000007
N  1.403682 -1.919303 0.000019
N  -3.280166 -0.239732 0.000184
C  0.016185 1.652359 0.000263
C  0.90307 0.546444 0.0001
C  0.437531 -0.781749 0.000052
C  -1.367714 1.36576 0.000286
C  -1.814018 0.029099 0.000172
C  -0.934015 -1.069235 0.000101
C  0.533442 3.074089 0.000303
H  -2.106323 2.171463 0.000387
H  -1.319951 -2.091656 0.000117
H  1.15958 3.270465 0.889772
H  1.158554 3.27082 -0.88981
H  -0.298029 3.794804 0.000931
